Android Build Error I can not solve

Hi everyone,
I am trying to build up my very first AppGyver APP but it keeps sending me this message:

Runtime version: 4.6.14; 
AB version: 1.7.6
COMMAND:

ASSETS_ARCHIVE_URL=https://blackgyver-meap-assets.s3.eu-west-1.amazonaws.com/87xlr6rd77ugwgdobaybpb0ddbcf?response-content-disposition=attachment%3B%20filename%3D%22assets.zip%22%3B%20filename%2A%3DUTF-8%27%27assets.zip&response-content-type=application%2Fzip&X-Amz-Algorithm=AWS4-HMAC-SHA256&X-Amz-Credential=AKIATG4VN3HFYKSVOEW2%2F20221008%2Feu-west-1%2Fs3%2Faws4_request&X-Amz-Date=20221008T185240Z&X-Amz-Expires=604800&X-Amz-SignedHeaders=host&X-Amz-Signature=f036f33b5f6005adc9b0cea3f80fd555d9d4463bb41a8c43d9b016a39f064e7d NODE_OPTIONS=--max-old-space-size=8096  npxrnv export -p android -s standalone -c standalone --ci --yes --skipRnvCheck --packageManager yarn --template @appgyver/orchestra-template-standalone@4.6.14 -r

FAILED with ERROR:

FAILURE: Build failed with an exception.

* What went wrong:
Could not determine the dependencies of task ':app:lintVitalRelease'.
> Could not resolve all artifacts for configuration ':app:debugRuntimeClasspath'.
> Could not find com.sap.cloud.android:foundation:4.0.0.
Searched in the following locations:
- https://www.jitpack.io/com/sap/cloud/android/foundation/4.0.0/foundation-4.0.0.pom
- https://repo.maven.apache.org/maven2/com/sap/cloud/android/foundation/4.0.0/foundation-4.0.0.pom
- https://dl.google.com/dl/android/maven2/com/sap/cloud/android/foundation/4.0.0/foundation-4.0.0.pom
- https://plugins.gradle.org/m2/com/sap/cloud/android/foundation/4.0.0/foundation-4.0.0.pom
- file:/tmp/107988-android-4056/node_modules/react-native-v8/dist/com/sap/cloud/android/foundation/4.0.0/foundation-4.0.0.pom
- file:/tmp/107988-android-4056/node_modules/v8-android/dist/com/sap/cloud/android/foundation/4.0.0/foundation-4.0.0.pom
- file:/tmp/107988-android-4056/node_modules/detox/Detox-android/com/sap/cloud/android/foundation/4.0.0/foundation-4.0.0.pom
Required by:
project :app > project :appgyver-react-native-sap-btp-mobile
> Could not find com.sap.cloud.android:fiori:4.0.0.
Searched in the following locations:
- https://www.jitpack.io/com/sap/cloud/android/fiori/4.0.0/fiori-4.0.0.pom
- https://repo.maven.apache.org/maven2/com/sap/cloud/android/fiori/4.0.0/fiori-4.0.0.pom
- https://dl.google.com/dl/android/maven2/com/sap/cloud/android/fiori/4.0.0/fiori-4.0.0.pom
- https://plugins.gradle.org/m2/com/sap/cloud/android/fiori/4.0.0/fiori-4.0.0.pom
- file:/tmp/107988-android-4056/node_modules/react-native-v8/dist/com/sap/cloud/android/fiori/4.0.0/fiori-4.0.0.pom
- file:/tmp/107988-android-4056/node_modules/v8-android/dist/com/sap/cloud/android/fiori/4.0.0/fiori-4.0.0.pom
- file:/tmp/107988-android-4056/node_modules/detox/Detox-android/com/sap/cloud/android/fiori/4.0.0/fiori-4.0.0.pom
Required by:
project :app > project :appgyver-react-native-sap-btp-mobile
> Could not find com.sap.cloud.android:onboarding:4.0.0.
Searched in the following locations:
- https://www.jitpack.io/com/sap/cloud/android/onboarding/4.0.0/onboarding-4.0.0.pom
- https://repo.maven.apache.org/maven2/com/sap/cloud/android/onboarding/4.0.0/onboarding-4.0.0.pom
- https://dl.google.com/dl/android/maven2/com/sap/cloud/android/onboarding/4.0.0/onboarding-4.0.0.pom
- https://plugins.gradle.org/m2/com/sap/cloud/android/onboarding/4.0.0/onboarding-4.0.0.pom
- file:/tmp/107988-android-4056/node_modules/react-native-v8/dist/com/sap/cloud/android/onboarding/4.0.0/onboarding-4.0.0.pom
- file:/tmp/107988-android-4056/node_modules/v8-android/dist/com/sap/cloud/android/onboarding/4.0.0/onboarding-4.0.0.pom
- file:/tmp/107988-android-4056/node_modules/detox/Detox-android/com/sap/cloud/android/onboarding/4.0.0/onboarding-4.0.0.pom
Required by:
project :app > project :appgyver-react-native-sap-btp-mobile
> Could not find com.sap.cloud.android:flowsv2:4.0.0.
Searched in the following locations:
- https://www.jitpack.io/com/sap/cloud/android/flowsv2/4.0.0/flowsv2-4.0.0.pom
- https://repo.maven.apache.org/maven2/com/sap/cloud/android/flowsv2/4.0.0/flowsv2-4.0.0.pom
- https://dl.google.com/dl/android/maven2/com/sap/cloud/android/flowsv2/4.0.0/flowsv2-4.0.0.pom
- https://plugins.gradle.org/m2/com/sap/cloud/android/flowsv2/4.0.0/flowsv2-4.0.0.pom
- file:/tmp/107988-android-4056/node_modules/react-native-v8/dist/com/sap/cloud/android/flowsv2/4.0.0/flowsv2-4.0.0.pom
- file:/tmp/107988-android-4056/node_modules/v8-android/dist/com/sap/cloud/android/flowsv2/4.0.0/flowsv2-4.0.0.pom
- file:/tmp/107988-android-4056/node_modules/detox/Detox-android/com/sap/cloud/android/flowsv2/4.0.0/flowsv2-4.0.0.pom
Required by:
project :app > project :appgyver-react-native-sap-btp-mobile

* Try:
Run with --stacktrace option to get the stack trace. Run with --info or --debug option to get more log output. Run with --scan to get full insights.

* Get more help at https://help.gradle.org

BUILD FAILED in 23s

Deprecated Gradle features were used in this build, making it incompatible with Gradle 7.0.
Use '--warning-mode all' to show the individual deprecation warnings.
See https://docs.gradle.org/6.7.1/userguide/command_line_interface.html#sec:command_line_warnings

Command failed with exit code 1: ./gradlew assembleRelease -x bundleReleaseJsAndAssets
Warning: Mapping new ns http://schemas.android.com/repository/android/common/02 to old ns http://schemas.android.com/repository/android/common/01
Warning: Mapping new ns http://schemas.android.com/repository/android/generic/02 to old ns http://schemas.android.com/repository/android/generic/01
Warning: Mapping new ns http://schemas.android.com/sdk/android/repo/addon2/02 to old ns http://schemas.android.com/sdk/android/repo/addon2/01
Warning: Mapping new ns http://schemas.android.com/sdk/android/repo/addon2/03 to old ns http://schemas.android.com/sdk/android/repo/addon2/01
Warning: Mapping new ns http://schemas.android.com/sdk/android/repo/repository2/02 to old ns http://schemas.android.com/sdk/android/repo/repository2/01
Warning: Mapping new ns http://schemas.android.com/sdk/android/repo/repository2/03 to old ns http://schemas.android.com/sdk/android/repo/repository2/01
Warning: Mapping new ns http://schemas.android.com/sdk/android/repo/sys-img2/03 to old ns http://schemas.android.com/sdk/android/repo/sys-img2/01
Warning: Mapping new ns http://schemas.android.com/sdk/android/repo/sys-img2/02 to old ns http://schemas.android.com/sdk/android/repo/sys-img2/01

FAILURE: Build failed with an exception.

* What went wrong:
Could not determine the dependencies of task ':app:lintVitalRelease'.
> Could not resolve all artifacts for configuration ':app:debugRuntimeClasspath'.
> Could not find com.sap.cloud.android:foundation:4.0.0.
Searched in the following locations:
- https://www.jitpack.io/com/sap/cloud/android/foundation/4.0.0/foundation-4.0.0.pom
- https://repo.maven.apache.org/maven2/com/sap/cloud/android/foundation/4.0.0/foundation-4.0.0.pom
- https://dl.google.com/dl/android/maven2/com/sap/cloud/android/foundation/4.0.0/foundation-4.0.0.pom
- https://plugins.gradle.org/m2/com/sap/cloud/android/foundation/4.0.0/foundation-4.0.0.pom
- file:/tmp/107988-android-4056/node_modules/react-native-v8/dist/com/sap/cloud/android/foundation/4.0.0/foundation-4.0.0.pom
- file:/tmp/107988-android-4056/node_modules/v8-android/dist/com/sap/cloud/android/foundation/4.0.0/foundation-4.0.0.pom
- file:/tmp/107988-android-4056/node_modules/detox/Detox-android/com/sap/cloud/android/foundation/4.0.0/foundation-4.0.0.pom
Required by:
project :app > project :appgyver-react-native-sap-btp-mobile
> Could not find com.sap.cloud.android:fiori:4.0.0.
Searched in the following locations:
- https://www.jitpack.io/com/sap/cloud/android/fiori/4.0.0/fiori-4.0.0.pom
- https://repo.maven.apache.org/maven2/com/sap/cloud/android/fiori/4.0.0/fiori-4.0.0.pom
- https://dl.google.com/dl/android/maven2/com/sap/cloud/android/fiori/4.0.0/fiori-4.0.0.pom
- https://plugins.gradle.org/m2/com/sap/cloud/android/fiori/4.0.0/fiori-4.0.0.pom
- file:/tmp/107988-android-4056/node_modules/react-native-v8/dist/com/sap/cloud/android/fiori/4.0.0/fiori-4.0.0.pom
- file:/tmp/107988-android-4056/node_modules/v8-android/dist/com/sap/cloud/android/fiori/4.0.0/fiori-4.0.0.pom
- file:/tmp/107988-android-4056/node_modules/detox/Detox-android/com/sap/cloud/android/fiori/4.0.0/fiori-4.0.0.pom
Required by:
project :app > project :appgyver-react-native-sap-btp-mobile
> Could not find com.sap.cloud.android:onboarding:4.0.0.
Searched in the following locations:
- https://www.jitpack.io/com/sap/cloud/android/onboarding/4.0.0/onboarding-4.0.0.pom
- https://repo.maven.apache.org/maven2/com/sap/cloud/android/onboarding/4.0.0/onboarding-4.0.0.pom
- https://dl.google.com/dl/android/maven2/com/sap/cloud/android/onboarding/4.0.0/onboarding-4.0.0.pom
- https://plugins.gradle.org/m2/com/sap/cloud/android/onboarding/4.0.0/onboarding-4.0.0.pom
- file:/tmp/107988-android-4056/node_modules/react-native-v8/dist/com/sap/cloud/android/onboarding/4.0.0/onboarding-4.0.0.pom
- file:/tmp/107988-android-4056/node_modules/v8-android/dist/com/sap/cloud/android/onboarding/4.0.0/onboarding-4.0.0.pom
- file:/tmp/107988-android-4056/node_modules/detox/Detox-android/com/sap/cloud/android/onboarding/4.0.0/onboarding-4.0.0.pom
Required by:
project :app > project :appgyver-react-native-sap-btp-mobile
> Could not find com.sap.cloud.android:flowsv2:4.0.0.
Searched in the following locations:
- https://www.jitpack.io/com/sap/cloud/android/flowsv2/4.0.0/flowsv2-4.0.0.pom
- https://repo.maven.apache.org/maven2/com/sap/cloud/android/flowsv2/4.0.0/flowsv2-4.0.0.pom
- https://dl.google.com/dl/android/maven2/com/sap/cloud/android/flowsv2/4.0.0/flowsv2-4.0.0.pom
- https://plugins.gradle.org/m2/com/sap/cloud/android/flowsv2/4.0.0/flowsv2-4.0.0.pom
- file:/tmp/107988-android-4056/node_modules/react-native-v8/dist/com/sap/cloud/android/flowsv2/4.0.0/flowsv2-4.0.0.pom
- file:/tmp/107988-android-4056/node_modules/v8-android/dist/com/sap/cloud/android/flowsv2/4.0.0/flowsv2-4.0.0.pom
- file:/tmp/107988-android-4056/node_modules/detox/Detox-android/com/sap/cloud/android/flowsv2/4.0.0/flowsv2-4.0.0.pom
Required by:
project :app > project :appgyver-react-native-sap-btp-mobile

* Try:
Run with --stacktrace option to get the stack trace. Run with --info or --debug option to get more log output. Run with --scan to get full insights.

* Get more help at https://help.gradle.org

BUILD FAILED in 23s
Starting a Gradle Daemon (subsequent builds will be faster)
Configuration on demand is an incubating feature.

> Configure project :app
Warning: The 'kotlin-android-extensions' Gradle plugin is deprecated. Please use this migration guide (https://goo.gle/kotlin-android-extensions-deprecation) to start working with View Binding (https://developer.android.com/topic/libraries/view-binding) and the 'kotlin-parcelize' plugin.
Copying ZSSRichTextEditor html asset file from /tmp/107988-android-4056/node_modules/@appgyver/react-native-zss-rich-text-editor/src/editor.html to /tmp/107988-android-4056/platformBuilds/standalone_android/app/src/main/assets

> Configure project :lottie-react-native
WARNING:: The specified Android SDK Build Tools version (28.0.0) is ignored, as it is below the minimum supported version (30.0.2) for Android Gradle Plugin 4.2.2.
Android SDK Build Tools 30.0.2 will be used.
To suppress this warning, remove "buildToolsVersion '28.0.0'" from your build.gradle file, as each version of the Android Gradle Plugin now has a default version of the build tools.

> Configure project :react-native-android-open-settings
WARNING:: minSdkVersion (26) is greater than targetSdkVersion (22) for variant "debug". Please change the values such that minSdkVersion is less than or equal to targetSdkVersion.
WARNING:: minSdkVersion (26) is greater than targetSdkVersion (22) for variant "release". Please change the values such that minSdkVersion is less than or equal to targetSdkVersion.

> Configure project :react-native-audio
WARNING:: Configuration 'compile' is obsolete and has been replaced with 'implementation' and 'api'.
It will be removed in version 7.0 of the Android Gradle plugin.
For more information, see http://d.android.com/r/tools/update-dependency-configurations.html.
WARNING:: minSdkVersion (26) is greater than targetSdkVersion (23) for variant "debug". Please change the values such that minSdkVersion is less than or equal to targetSdkVersion.
WARNING:: minSdkVersion (26) is greater than targetSdkVersion (23) for variant "release". Please change the values such that minSdkVersion is less than or equal to targetSdkVersion.

> Configure project :react-native-dynamic-fonts
WARNING:: Configuration 'compile' is obsolete and has been replaced with 'implementation' and 'api'.
It will be removed in version 7.0 of the Android Gradle plugin.
For more information, see http://d.android.com/r/tools/update-dependency-configurations.html.

> Configure project :react-native-exception-handler
WARNING:: minSdkVersion (26) is greater than targetSdkVersion (22) for variant "debug". Please change the values such that minSdkVersion is less than or equal to targetSdkVersion.
WARNING:: minSdkVersion (26) is greater than targetSdkVersion (22) for variant "release". Please change the values such that minSdkVersion is less than or equal to targetSdkVersion.

> Configure project :react-native-image-resizer
WARNING:: Configuration 'compile' is obsolete and has been replaced with 'implementation' and 'api'.
It will be removed in version 7.0 of the Android Gradle plugin.
For more information, see http://d.android.com/r/tools/update-dependency-configurations.html.
WARNING:: minSdkVersion (26) is greater than targetSdkVersion (23) for variant "debug". Please change the values such that minSdkVersion is less than or equal to targetSdkVersion.
WARNING:: minSdkVersion (26) is greater than targetSdkVersion (23) for variant "release". Please change the values such that minSdkVersion is less than or equal to targetSdkVersion.

> Configure project :react-native-linear-gradient
WARNING:: Configuration 'provided' is obsolete and has been replaced with 'compileOnly'.
It will be removed in version 7.0 of the Android Gradle plugin.
For more information, see http://d.android.com/r/tools/update-dependency-configurations.html.

> Configure project :react-native-picker
WARNING:: Configuration 'compile' is obsolete and has been replaced with 'implementation' and 'api'.
It will be removed in version 7.0 of the Android Gradle plugin.
For more information, see http://d.android.com/r/tools/update-dependency-configurations.html.

> Configure project :react-native-screens
WARNING:: minSdkVersion (26) is greater than targetSdkVersion (22) for variant "debug". Please change the values such that minSdkVersion is less than or equal to targetSdkVersion.
WARNING:: minSdkVersion (26) is greater than targetSdkVersion (22) for variant "release". Please change the values such that minSdkVersion is less than or equal to targetSdkVersion.

> Configure project :react-native-simple-compass
WARNING:: Configuration 'compile' is obsolete and has been replaced with 'implementation' and 'api'.
It will be removed in version 7.0 of the Android Gradle plugin.
For more information, see http://d.android.com/r/tools/update-dependency-configurations.html.
WARNING:: minSdkVersion (26) is greater than targetSdkVersion (22) for variant "debug". Please change the values such that minSdkVersion is less than or equal to targetSdkVersion.
WARNING:: minSdkVersion (26) is greater than targetSdkVersion (22) for variant "release". Please change the values such that minSdkVersion is less than or equal to targetSdkVersion.

> Configure project :react-native-simple-shadow-view
WARNING:: minSdkVersion (26) is greater than targetSdkVersion (16) for variant "debug". Please change the values such that minSdkVersion is less than or equal to targetSdkVersion.
WARNING:: minSdkVersion (26) is greater than targetSdkVersion (16) for variant "release". Please change the values such that minSdkVersion is less than or equal to targetSdkVersion.

> Configure project :react-native-webrtc
WARNING:: minSdkVersion (26) is greater than targetSdkVersion (23) for variant "debug". Please change the values such that minSdkVersion is less than or equal to targetSdkVersion.
WARNING:: minSdkVersion (26) is greater than targetSdkVersion (23) for variant "release". Please change the values such that minSdkVersion is less than or equal to targetSdkVersion.

> Configure project :react-native-webview-bridge
WARNING:: Configuration 'compile' is obsolete and has been replaced with 'implementation' and 'api'.
It will be removed in version 7.0 of the Android Gradle plugin.
For more information, see http://d.android.com/r/tools/update-dependency-configurations.html.
WARNING:: minSdkVersion (26) is greater than targetSdkVersion (23) for variant "debug". Please change the values such that minSdkVersion is less than or equal to targetSdkVersion.
WARNING:: minSdkVersion (26) is greater than targetSdkVersion (23) for variant "release". Please change the values such that minSdkVersion is less than or equal to targetSdkVersion.

Deprecated Gradle features were used in this build, making it incompatible with Gradle 7.0.
Use '--warning-mode all' to show the individual deprecation warnings.
See https://docs.gradle.org/6.7.1/userguide/command_line_interface.html#sec:command_line_warnings

Warning: Mapping new ns http://schemas.android.com/repository/android/common/02 to old ns http://schemas.android.com/repository/android/common/01
Warning: Mapping new ns http://schemas.android.com/repository/android/generic/02 to old ns http://schemas.android.com/repository/android/generic/01
Warning: Mapping new ns http://schemas.android.com/sdk/android/repo/addon2/02 to old ns http://schemas.android.com/sdk/android/repo/addon2/01
Warning: Mapping new ns http://schemas.android.com/sdk/android/repo/addon2/03 to old ns http://schemas.android.com/sdk/android/repo/addon2/01
Warning: Mapping new ns http://schemas.android.com/sdk/android/repo/repository2/02 to old ns http://schemas.android.com/sdk/android/repo/repository2/01
Warning: Mapping new ns http://schemas.android.com/sdk/android/repo/repository2/03 to old ns http://schemas.android.com/sdk/android/repo/repository2/01
Warning: Mapping new ns http://schemas.android.com/sdk/android/repo/sys-img2/03 to old ns http://schemas.android.com/sdk/android/repo/sys-img2/01
Warning: Mapping new ns http://schemas.android.com/sdk/android/repo/sys-img2/02 to old ns http://schemas.android.com/sdk/android/repo/sys-img2/01

FAILURE: Build failed with an exception.

* What went wrong:
Could not determine the dependencies of task ':app:lintVitalRelease'.
> Could not resolve all artifacts for configuration ':app:debugRuntimeClasspath'.
> Could not find com.sap.cloud.android:foundation:4.0.0.
Searched in the following locations:
- https://www.jitpack.io/com/sap/cloud/android/foundation/4.0.0/foundation-4.0.0.pom
- https://repo.maven.apache.org/maven2/com/sap/cloud/android/foundation/4.0.0/foundation-4.0.0.pom
- https://dl.google.com/dl/android/maven2/com/sap/cloud/android/foundation/4.0.0/foundation-4.0.0.pom
- https://plugins.gradle.org/m2/com/sap/cloud/android/foundation/4.0.0/foundation-4.0.0.pom
- file:/tmp/107988-android-4056/node_modules/react-native-v8/dist/com/sap/cloud/android/foundation/4.0.0/foundation-4.0.0.pom
- file:/tmp/107988-android-4056/node_modules/v8-android/dist/com/sap/cloud/android/foundation/4.0.0/foundation-4.0.0.pom
- file:/tmp/107988-android-4056/node_modules/detox/Detox-android/com/sap/cloud/android/foundation/4.0.0/foundation-4.0.0.pom
Required by:
project :app > project :appgyver-react-native-sap-btp-mobile
> Could not find com.sap.cloud.android:fiori:4.0.0.
Searched in the following locations:
- https://www.jitpack.io/com/sap/cloud/android/fiori/4.0.0/fiori-4.0.0.pom
- https://repo.maven.apache.org/maven2/com/sap/cloud/android/fiori/4.0.0/fiori-4.0.0.pom
- https://dl.google.com/dl/android/maven2/com/sap/cloud/android/fiori/4.0.0/fiori-4.0.0.pom
- https://plugins.gradle.org/m2/com/sap/cloud/android/fiori/4.0.0/fiori-4.0.0.pom
- file:/tmp/107988-android-4056/node_modules/react-native-v8/dist/com/sap/cloud/android/fiori/4.0.0/fiori-4.0.0.pom
- file:/tmp/107988-android-4056/node_modules/v8-android/dist/com/sap/cloud/android/fiori/4.0.0/fiori-4.0.0.pom
- file:/tmp/107988-android-4056/node_modules/detox/Detox-android/com/sap/cloud/android/fiori/4.0.0/fiori-4.0.0.pom
Required by:
project :app > project :appgyver-react-native-sap-btp-mobile
> Could not find com.sap.cloud.android:onboarding:4.0.0.
Searched in the following locations:
- https://www.jitpack.io/com/sap/cloud/android/onboarding/4.0.0/onboarding-4.0.0.pom
- https://repo.maven.apache.org/maven2/com/sap/cloud/android/onboarding/4.0.0/onboarding-4.0.0.pom
- https://dl.google.com/dl/android/maven2/com/sap/cloud/android/onboarding/4.0.0/onboarding-4.0.0.pom
- https://plugins.gradle.org/m2/com/sap/cloud/android/onboarding/4.0.0/onboarding-4.0.0.pom
- file:/tmp/107988-android-4056/node_modules/react-native-v8/dist/com/sap/cloud/android/onboarding/4.0.0/onboarding-4.0.0.pom
- file:/tmp/107988-android-4056/node_modules/v8-android/dist/com/sap/cloud/android/onboarding/4.0.0/onboarding-4.0.0.pom
- file:/tmp/107988-android-4056/node_modules/detox/Detox-android/com/sap/cloud/android/onboarding/4.0.0/onboarding-4.0.0.pom
Required by:
project :app > project :appgyver-react-native-sap-btp-mobile
> Could not find com.sap.cloud.android:flowsv2:4.0.0.
Searched in the following locations:
- https://www.jitpack.io/com/sap/cloud/android/flowsv2/4.0.0/flowsv2-4.0.0.pom
- https://repo.maven.apache.org/maven2/com/sap/cloud/android/flowsv2/4.0.0/flowsv2-4.0.0.pom
- https://dl.google.com/dl/android/maven2/com/sap/cloud/android/flowsv2/4.0.0/flowsv2-4.0.0.pom
- https://plugins.gradle.org/m2/com/sap/cloud/android/flowsv2/4.0.0/flowsv2-4.0.0.pom
- file:/tmp/107988-android-4056/node_modules/react-native-v8/dist/com/sap/cloud/android/flowsv2/4.0.0/flowsv2-4.0.0.pom
- file:/tmp/107988-android-4056/node_modules/v8-android/dist/com/sap/cloud/android/flowsv2/4.0.0/flowsv2-4.0.0.pom
- file:/tmp/107988-android-4056/node_modules/detox/Detox-android/com/sap/cloud/android/flowsv2/4.0.0/flowsv2-4.0.0.pom
Required by:
project :app > project :appgyver-react-native-sap-btp-mobile

* Try:
Run with --stacktrace option to get the stack trace. Run with --info or --debug option to get more log output. Run with --scan to get full insights.

* Get more help at https://help.gradle.org

BUILD FAILED in 23s

Error: Command failed with exit code 1: ./gradlew assembleRelease -x bundleReleaseJsAndAssets
Warning: Mapping new ns http://schemas.android.com/repository/android/common/02 to old ns http://schemas.android.com/repository/android/common/01
Warning: Mapping new ns http://schemas.android.com/repository/android/generic/02 to old ns http://schemas.android.com/repository/android/generic/01
Warning: Mapping new ns http://schemas.android.com/sdk/android/repo/addon2/02 to old ns http://schemas.android.com/sdk/android/repo/addon2/01
Warning: Mapping new ns http://schemas.android.com/sdk/android/repo/addon2/03 to old ns http://schemas.android.com/sdk/android/repo/addon2/01
Warning: Mapping new ns http://schemas.android.com/sdk/android/repo/repository2/02 to old ns http://schemas.android.com/sdk/android/repo/repository2/01
Warning: Mapping new ns http://schemas.android.com/sdk/android/repo/repository2/03 to old ns http://schemas.android.com/sdk/android/repo/repository2/01
Warning: Mapping new ns http://schemas.android.com/sdk/android/repo/sys-img2/03 to old ns http://schemas.android.com/sdk/android/repo/sys-img2/01
Warning: Mapping new ns http://schemas.android.com/sdk/android/repo/sys-img2/02 to old ns http://schemas.android.com/sdk/android/repo/sys-img2/01

FAILURE: Build failed with an exception.

* What went wrong:
Could not determine the dependencies of task ':app:lintVitalRelease'.
> Could not resolve all artifacts for configuration ':app:debugRuntimeClasspath'.
> Could not find com.sap.cloud.android:foundation:4.0.0.
Searched in the following locations:
- https://www.jitpack.io/com/sap/cloud/android/foundation/4.0.0/foundation-4.0.0.pom
- https://repo.maven.apache.org/maven2/com/sap/cloud/android/foundation/4.0.0/foundation-4.0.0.pom
- https://dl.google.com/dl/android/maven2/com/sap/cloud/android/foundation/4.0.0/foundation-4.0.0.pom
- https://plugins.gradle.org/m2/com/sap/cloud/android/foundation/4.0.0/foundation-4.0.0.pom
- file:/tmp/107988-android-4056/node_modules/react-native-v8/dist/com/sap/cloud/android/foundation/4.0.0/foundation-4.0.0.pom
- file:/tmp/107988-android-4056/node_modules/v8-android/dist/com/sap/cloud/android/foundation/4.0.0/foundation-4.0.0.pom
- file:/tmp/107988-android-4056/node_modules/detox/Detox-android/com/sap/cloud/android/foundation/4.0.0/foundation-4.0.0.pom
Required by:
project :app > project :appgyver-react-native-sap-btp-mobile
> Could not find com.sap.cloud.android:fiori:4.0.0.
Searched in the following locations:
- https://www.jitpack.io/com/sap/cloud/android/fiori/4.0.0/fiori-4.0.0.pom
- https://repo.maven.apache.org/maven2/com/sap/cloud/android/fiori/4.0.0/fiori-4.0.0.pom
- https://dl.google.com/dl/android/maven2/com/sap/cloud/android/fiori/4.0.0/fiori-4.0.0.pom
- https://plugins.gradle.org/m2/com/sap/cloud/android/fiori/4.0.0/fiori-4.0.0.pom
- file:/tmp/107988-android-4056/node_modules/react-native-v8/dist/com/sap/cloud/android/fiori/4.0.0/fiori-4.0.0.pom
- file:/tmp/107988-android-4056/node_modules/v8-android/dist/com/sap/cloud/android/fiori/4.0.0/fiori-4.0.0.pom
- file:/tmp/107988-android-4056/node_modules/detox/Detox-android/com/sap/cloud/android/fiori/4.0.0/fiori-4.0.0.pom
Required by:
project :app > project :appgyver-react-native-sap-btp-mobile
> Could not find com.sap.cloud.android:onboarding:4.0.0.
Searched in the following locations:
- https://www.jitpack.io/com/sap/cloud/android/onboarding/4.0.0/onboarding-4.0.0.pom
- https://repo.maven.apache.org/maven2/com/sap/cloud/android/onboarding/4.0.0/onboarding-4.0.0.pom
- https://dl.google.com/dl/android/maven2/com/sap/cloud/android/onboarding/4.0.0/onboarding-4.0.0.pom
- https://plugins.gradle.org/m2/com/sap/cloud/android/onboarding/4.0.0/onboarding-4.0.0.pom
- file:/tmp/107988-android-4056/node_modules/react-native-v8/dist/com/sap/cloud/android/onboarding/4.0.0/onboarding-4.0.0.pom
- file:/tmp/107988-android-4056/node_modules/v8-android/dist/com/sap/cloud/android/onboarding/4.0.0/onboarding-4.0.0.pom
- file:/tmp/107988-android-4056/node_modules/detox/Detox-android/com/sap/cloud/android/onboarding/4.0.0/onboarding-4.0.0.pom
Required by:
project :app > project :appgyver-react-native-sap-btp-mobile
> Could not find com.sap.cloud.android:flowsv2:4.0.0.
Searched in the following locations:
- https://www.jitpack.io/com/sap/cloud/android/flowsv2/4.0.0/flowsv2-4.0.0.pom
- https://repo.maven.apache.org/maven2/com/sap/cloud/android/flowsv2/4.0.0/flowsv2-4.0.0.pom
- https://dl.google.com/dl/android/maven2/com/sap/cloud/android/flowsv2/4.0.0/flowsv2-4.0.0.pom
- https://plugins.gradle.org/m2/com/sap/cloud/android/flowsv2/4.0.0/flowsv2-4.0.0.pom
- file:/tmp/107988-android-4056/node_modules/react-native-v8/dist/com/sap/cloud/android/flowsv2/4.0.0/flowsv2-4.0.0.pom
- file:/tmp/107988-android-4056/node_modules/v8-android/dist/com/sap/cloud/android/flowsv2/4.0.0/flowsv2-4.0.0.pom
- file:/tmp/107988-android-4056/node_modules/detox/Detox-android/com/sap/cloud/android/flowsv2/4.0.0/flowsv2-4.0.0.pom
Required by:
project :app > project :appgyver-react-native-sap-btp-mobile

* Try:
Run with --stacktrace option to get the stack trace. Run with --info or --debug option to get more log output. Run with --scan to get full insights.

* Get more help at https://help.gradle.org

BUILD FAILED in 23s
Starting a Gradle Daemon (subsequent builds will be faster)
Configuration on demand is an incubating feature.

Any clue?
Thanks!

I have the exact same issue. Did you find a solution?

Hi Stijin,

No solves for this at the moment, I have unsuscribed the AppGyver service from my SAP BTP because there is no sense on keep paying for something that is not working or not giving support at all.

Please, tell me if you find a solution for this in the future.

Good luck.

Hi @David_Rod.Fer,

As a BTP customer, you are entitled to dedicated support through SAP’s support portal. Community forums are mostly maintained by volunteer community edition users, so it is likely that your issue can be overlooked.

For bugs and problems, please either use the SAP support or https://tracker.appgyver.com/. The AppGyver teams maintains both daily.