Android build given error message

Hey,
Your build for application testing ended up failing.

We detected at least the following error in the build:

AB version: 1.7.8 COMMAND: ASSETS_ARCHIVE_URL=https://appgyver-meap-assets.s3.amazonaws.com/xv0114xiyhcu928nglghuorqli4e?response-content-disposition=attachment%3B%20filename%3D"assets.zip"%3B%20filename*%3DUTF-8’'assets.zip&response-content-type=application%2Fzip&X-Amz-Algorithm=AWS4-HMAC-SHA256&X-Amz-Credential=AKIAJJSXXQRL4UNGBAXQ%2F20230112%2Fus-east-1%2Fs3%2Faws4_request&X-Amz-Date=20230112T144313Z&X-Amz-Expires=604800&X-Amz-SignedHeaders=host&X-Amz-Signature=0e79caf0b63dca1e8d2725d171445b843c0b6b67c4e7b8f80865580712774d08 NODE_OPTIONS=–max-old-space-size=8096 npxrnv export -p android -s standalone -c standalone --ci --yes --skipRnvCheck --packageManager yarn --template @appgyver/orchestra-template-standalone@4.6.28 -r FAILED with ERROR: FAILURE: Build failed with an exception. * What went wrong: Execution failed for task ‘:app:mergeReleaseResources’. > A failure occurred while executing com.android.build.gradle.internal.res.Aapt2CompileRunnable > Android resource compilation failed ERROR:/tmp/617099-android-265138/platformBuilds/standalone_android/app/src/main/res/mipmap-xhdpi/splash_screen.png: AAPT: error: failed to read PNG signature: file does not start with PNG signature. ERROR:/tmp/617099-android-265138/platformBuilds/standalone_android/app/src/main/res/mipmap-xhdpi/splash_screen.png: AAPT: error: file failed to compile. * Try: Run with --stacktrace option to get the stack trace. Run with --info or --debug option to get more log output. Run with --scan to get full insights. * Get more help at https://help.gradle.org BUILD FAILED in 31s Deprecated Gradle features were used in this build, making it incompatible with Gradle 7.0. Use ‘–warning-mode all’ to show the individual deprecation warnings. See

It is recommended to check the splash_screen.png file and try using another image file or verify if the format is correct (you could change the format from PNG to JPG). If the error persists, it may be something internal, due to the use of deprecated functions of Gradle in this compilation, making it incompatible with Gradle 7.0. It is advisable to send a report to AppGyver.