Buiild Failed: Could not find com.github.prscX:photo-editor-android:master-SNAPSHOT

Hello, probably it’s not Appgyver’s fail. But probably only you can fix it:
error code:

AB version: 0.2.50 COMMAND: dockerrun --rm -v /tmp/423059-android:/app:z -v /home/ec2-user/.npmrc:/opt/android-sdk-linux/.npmrc android bash -c ‘rnv export -p android -s standalone -c standalone --ci --yes --skipRnvCheck --packageManager yarn --template @appgyver/orchestra-template-standalone@3.4.4’ FAILED with ERROR: FAILURE: Build failed with an exception. * What went wrong: Could not determine the dependencies of task ‘:app:lintVitalRelease’. > Could not resolve all artifacts for configuration ‘:app:debugRuntimeClasspath’. > Could not find com.github.prscX:photo-editor-android:master-SNAPSHOT. Searched in the following locations: - https://dl.google.com/dl/android/maven2/com/github/prscX/photo-editor-android/master-SNAPSHOT/maven-metadata.xml - https://dl.google.com/dl/android/maven2/com/github/prscX/photo-editor-android/master-SNAPSHOT/photo-editor-android-master-SNAPSHOT.pom - https://repo.maven.apache.org/maven2/com/github/prscX/photo-editor-android/master-SNAPSHOT/maven-metadata.xml - https://repo.maven.apache.org/maven2/com/github/prscX/photo-editor-android/master-SNAPSHOT/photo-editor-android-master-SNAPSHOT.pom - https://www.jitpack.io/com/github/prscX/photo-editor-android/master-SNAPSHOT/maven-metadata.xml - https://www.jitpack.io/com/github/prscX/photo-editor-android/master-SNAPSHOT/photo-editor-android-master-f5dc1ff4f3-1.pom - https://jcenter.bintray.com/com/github/prscX/photo-editor-android/master-SNAPSHOT/maven-metadata.xml - https://jcenter.bintray.com/com/github/prscX/photo-editor-android/master-SNAPSHOT/photo-editor-android-master-SNAPSHOT.pom - file:/app/node_modules/react-native-v8/dist/com/github/prscX/photo-editor-android/master-SNAPSHOT/maven-metadata.xml - file:/app/node_modules/react-native-v8/dist/com/github/prscX/photo-editor-android/master-SNAPSHOT/photo-editor-android-master-SNAPSHOT.pom - file:/app/node_modules/v8-android/dist/com/github/prscX/photo-editor-android/master-SNAPSHOT/maven-metadata.xml - file:/app/node_modules/v8-android/dist/com/github/prscX/photo-editor-android/master-SNAPSHOT/photo-editor-android-master-SNAPSHOT.pom - file:/app/node_modules/detox/Detox-android/com/github/prscX/photo-editor-android/master-SNAPSHOT/maven-metadata.xml - file:/app/node_modules/detox/Detox-android/com/github/prscX/photo-editor-android/master-SNAPSHOT/photo-editor-android-master-SNAPSHOT.pom - https://maven.fabric.io/public/com/github/prscX/photo-editor-android/master-SNAPSHOT/maven-metadata.xml - https://maven.fabric.io/public/com/github/prscX/photo-editor-android/master-SNAPSHOT/photo-editor-android-master-SNAPSHOT.pom Required by: project :app > project :react-native-photo-editor * Try: Run with --stacktrace option to get the stack trace. Run with --info or --debug option to get more log output. Run with --scan to get full insights. * Get more help at https://help.gradle.org Deprecated Gradle features were used in this build, making it incompatible with Gradle 7.0. Use ‘–warning-mode all’ to show the individual deprecation warnings. See Command-Line Interface BUILD FAILED in 2m 13s Command failed with exit code 1 (EPERM): ./gradlew assembleRelease -x bundleReleaseJsAndAssets Warning: Mapping new ns http://schemas.android.com/repository/android/common/02 to old ns http://schemas.android.com/repository/android/common/01 Warning: Mapping new ns http://schemas.android.com/repository/android/generic/02 to old ns http://schemas.android.com/repository/android/generic/01 Warning: Mapping new ns http://schemas.android.com/sdk/android/repo/addon2/02 to old ns http://schemas.android.com/sdk/android/repo/addon2/01 Warning: Mapping new ns http://schemas.android.com/sdk/android/repo/repository2/02 to old ns http://schemas.android.com/sdk/android/repo/repository2/01 Warning: Mapping new ns http://schemas.android.com/sdk/android/repo/sys-img2/02 to old ns http://schemas.android.com/sdk/android/repo/sys-img2/01 FAILURE: Build failed with an exception. * What went wrong: Could not determine the dependencies of task ‘:app:lintVitalRelease’. > Could not resolve all artifacts for configuration ‘:app:debugRuntimeClasspath’. > Could not find com.github.prscX:photo-editor-android:master-SNAPSHOT. Searched in the following locations: - https://dl.google.com/dl/android/maven2/com/github/prscX/photo-editor-android/master-SNAPSHOT/maven-metadata.xml - https://dl.google.com/dl/android/maven2/com/github/prscX/photo-editor-android/master-SNAPSHOT/photo-editor-android-master-SNAPSHOT.pom - https://repo.maven.apache.org/maven2/com/github/prscX/photo-editor-android/master-SNAPSHOT/maven-metadata.xml - https://repo.maven.apache.org/maven2/com/github/prscX/photo-editor-android/master-SNAPSHOT/photo-editor-android-master-SNAPSHOT.pom - https://www.jitpack.io/com/github/prscX/photo-editor-android/master-SNAPSHOT/maven-metadata.xml - https://www.jitpack.io/com/github/prscX/photo-editor-android/master-SNAPSHOT/photo-editor-android-master-f5dc1ff4f3-1.pom - https://jcenter.bintray.com/com/github/prscX/photo-editor-android/master-SNAPSHOT/maven-metadata.xml - https://jcenter.bintray.com/com/github/prscX/photo-editor-android/master-SNAPSHOT/photo-editor-android-master-SNAPSHOT.pom - file:/app/node_modules/react-native-v8/dist/com/github/prscX/photo-editor-android/master-SNAPSHOT/maven-metadata.xml - file:/app/node_modules/react-native-v8/dist/com/github/prscX/photo-editor-android/master-SNAPSHOT/photo-editor-android-master-SNAPSHOT.pom - file:/app/node_modules/v8-android/dist/com/github/prscX/photo-editor-android/master-SNAPSHOT/maven-metadata.xml - file:/app/node_modules/v8-android/dist/com/github/prscX/photo-editor-android/master-SNAPSHOT/photo-editor-android-master-SNAPSHOT.pom - file:/app/node_modules/detox/Detox-android/com/github/prscX/photo-editor-android/master-SNAPSHOT/maven-metadata.xml - file:/app/node_modules/detox/Detox-android/com/github/prscX/photo-editor-android/master-SNAPSHOT/photo-editor-android-master-SNAPSHOT.pom - https://maven.fabric.io/public/com/github/prscX/photo-editor-android/master-SNAPSHOT/maven-metadata.xml - https://maven.fabric.io/public/com/github/prscX/photo-editor-android/master-SNAPSHOT/photo-editor-android-master-SNAPSHOT.pom Required by: project :app > project :react-native-photo-editor * Try: Run with --stacktrace option to get the stack trace. Run with --info or --debug option to get more log output. Run with --scan to get full insights. * Get more help at https://help.gradle.org BUILD FAILED in 2m 13s Error: Command failed with exit code 1 (EPERM): ./gradlew assembleRelease -x bundleReleaseJsAndAssets at makeError (/app/node_modules/rnv/node_modules/execa/lib/error.js:58:11) at handlePromise (/app/node_modules/rnv/node_modules/execa/index.js:112:26) at runMicrotasks () at processTicksAndRejections (node:internal/process/task_queues:96:5) │ │ │ Project location: │ │ ./platformBuilds/standalone_android │

Hi! This problem was fixed I believe, can you confirm if it’s now working for you?

unfortunately not. Just tried again to build. Get this error:

e
-------------------------------
DOLAN PARSER REPORT
-------------------------------
TOTAL PAGES:  e[33m16e[39m
TOTAL COMPONENTS:  e[33m320e[39m
TOTAL BINDINGS:  e[33m152e[39m
TOTAL BIND DEPENDECIES:  e[33m324e[39m
NORMALIZED BINDINGS: e[33m156e[39m
REMOVED EXPRESSIONS:  e[33m32e[39m
INVALID EXPRESSIONS:  e[33m0e[39m
FIXED EXPRESSIONS:  e[33m0e[39m
TOTAL EXPRESSIONS:  e[33m171e[39m
CONFLICTING COMPONENT IDS e[33m0e[39m
TOTAL FLOWS:  e[33m607e[39m
-------------------------------


[ hook ] [configure] DOWNLOAD IMAGES 
Matched image https://s3.amazonaws.com/appgyver.assets/composer3/images/image_placeholder.png
downloadImages:URLS: []
cleanFolder /Users/ec2-user/app-builder/STAGING/client/packages/app-standalone/platformAssets/runtime/_temp
NO IMAGES to download
[ task ] <= [package] <= configure
[ task ] [package] packageAndroid[1]
[ info ] [package] ANDROID PACKAGE STARTING...
Executing: react-native bundle --platform android --dev false --assets-dest /Users/ec2-user/app-builder/STAGING/client/packages/app-standalone/platformBuilds/app_423059_android/app/src/main/res --entry-file index.client.android.js --bundle-output /Users/ec2-user/app-builder/STAGING/client/packages/app-standalone/platformBuilds/app_423059_android/app/src/main/assets/index.android.bundle --config=metro.config.js - 30s
Executing: react-native bundle --platform android --dev false --assets-dest /Users/ec2-user/app-builder/STAGING/client/packages/app-standalone/platformBuilds/app_423059_android/app/src/main/res --entry-file index.client.android.js --bundle-output /Users/ec2-user/app-builder/STAGING/client/packages/app-standalone/platformBuilds/app_423059_android/app/src/main/assets/index.android.bundle --config=metro.config.js - 60s
Executing: react-native bundle --platform android --dev false --assets-dest /Users/ec2-user/app-builder/STAGING/client/packages/app-standalone/platformBuilds/app_423059_android/app/src/main/res --entry-file index.client.android.js --bundle-output /Users/ec2-user/app-builder/STAGING/client/packages/app-standalone/platformBuilds/app_423059_android/app/src/main/assets/index.android.bundle --config=metro.config.js - 90s
Executing: react-native bundle --platform android --dev false --assets-dest /Users/ec2-user/app-builder/STAGING/client/packages/app-standalone/platformBuilds/app_423059_android/app/src/main/res --entry-file index.client.android.js --bundle-output /Users/ec2-user/app-builder/STAGING/client/packages/app-standalone/platformBuilds/app_423059_android/app/src/main/assets/index.android.bundle --config=metro.config.js - 120s
Executing: react-native bundle --platform android --dev false --assets-dest /Users/ec2-user/app-builder/STAGING/client/packages/app-standalone/platformBuilds/app_423059_android/app/src/main/res --entry-file index.client.android.js --bundle-output /Users/ec2-user/app-builder/STAGING/client/packages/app-standalone/platformBuilds/app_423059_android/app/src/main/assets/index.android.bundle --config=metro.config.js - 150s
Executing: react-native bundle --platform android --dev false --assets-dest /Users/ec2-user/app-builder/STAGING/client/packages/app-standalone/platformBuilds/app_423059_android/app/src/main/res --entry-file index.client.android.js --bundle-output /Users/ec2-user/app-builder/STAGING/client/packages/app-standalone/platformBuilds/app_423059_android/app/src/main/assets/index.android.bundle --config=metro.config.js - 180s
Executing: react-native bundle --platform android --dev false --assets-dest /Users/ec2-user/app-builder/STAGING/client/packages/app-standalone/platformBuilds/app_423059_android/app/src/main/res --entry-file index.client.android.js --bundle-output /Users/ec2-user/app-builder/STAGING/client/packages/app-standalone/platformBuilds/app_423059_android/app/src/main/assets/index.android.bundle --config=metro.config.js - 210s
[ info ] [package] ANDROID PACKAGE FINISHED
[ hook ] [package] executePipe ('package:after')
[ task ] <= [build] <= package
[ task ] [build] buildAndroid[1]
[ task ] [build] _runGradleApp[1]
┌──────────────────────────────────────────────────────────────────────────────┐
│  🚀  SUMMARY | 2/8/2022, 2:03:46 PM                                          │
│  $ rnv export -p android -c app_423059 -s standalone --ci --mono --no-install
├──────────────────────────────────────────────────────────────────────────────┤
│  ReNative Version: 0.32.1                                                    │
│  Project Name ($package.name): @appgyver/orchestra-app-standalone            │
│  Project Version ($package.version): 3.3.3                                   │
│  Workspace ($.workspaceID): buildservice                                     │
│  Platform (-p): android                                                      │
│  Engine ($.platforms.android.engine): engine-rn                              │
│  App Config (-c): app_423059                                                 │
│  Build Scheme (-s): standalone                                               │
│  Bundle assets ($.platforms.android.bundleAssets): true                      │
│  Target (-t): Nexus_5X_API_26                                                │
│  Supported Platforms: android                                                │
│  Env Info: darwin | x64 | node v16.12.0                                      │
│  Executed Time: 0h:3m:41s:845ms                                              │
│                                                                              │
│ [ warn ] [workspace configure] You're missing defaultTargets in your config /Users/ec2-user/app-builder/STAGING/dotappgyver/renative.json. Let's add them!
│ [ warn ] [project configure] No Match found in /Users/ec2-user/app-builder/STAGING/client/node_modules/next/dist/lib/find-pages-dir.js for expression: let curDir=_path.default.join(dir,'pages').
Consider update or removal of /Users/ec2-user/app-builder/STAGING/client/node_modules/rnv/pluginTemplates/next/overrides.json
│ [ warn ] [configure] DEPRECATED structure in /Users/ec2-user/app-builder/STAGING/dotappgyver/@appgyver/orchestra-app-standalone/appConfigs/app_423059/renative.private.json.
Your android object needs to be located under platforms object.
│ [ warn ] [configure] You are missing backgroundColor in your renative config. will use default #FFFFFF instead
│ [ error ] [build] COMMAND: 

./gradlew bundleRelease -x bundleReleaseJsAndAssets 

FAILED with ERROR: 

FAILURE: Build failed with an exception.

* What went wrong:
Could not determine the dependencies of task ':app:preReleaseBuild'.
> Could not resolve all task dependencies for configuration ':app:releaseRuntimeClasspath'.
   > Could not find com.github.prscX:photo-editor-android:master-SNAPSHOT.
     Searched in the following locations:
       - file:/Users/ec2-user/Library/Android/sdk/extras/m2repository/com/github/prscX/photo-editor-android/master-SNAPSHOT/maven-metadata.xml
       - file:/Users/ec2-user/Library/Android/sdk/extras/m2repository/com/github/prscX/photo-editor-android/master-SNAPSHOT/photo-editor-android-master-SNAPSHOT.pom
       - file:/Users/ec2-user/Library/Android/sdk/extras/m2repository/com/github/prscX/photo-editor-android/master-SNAPSHOT/photo-editor-android-master-SNAPSHOT.jar
       - file:/Users/ec2-user/Library/Android/sdk/extras/google/m2repository/com/github/prscX/photo-editor-android/master-SNAPSHOT/maven-metadata.xml
       - file:/Users/ec2-user/Library/Android/sdk/extras/google/m2repository/com/github/prscX/photo-editor-android/master-SNAPSHOT/photo-editor-android-master-SNAPSHOT.pom
       - file:/Users/ec2-user/Library/Android/sdk/extras/google/m2repository/com/github/prscX/photo-editor-android/master-SNAPSHOT/photo-editor-android-master-SNAPSHOT.jar
       - file:/Users/ec2-user/Library/Android/sdk/extras/android/m2repository/com/github/prscX/photo-editor-android/master-SNAPSHOT/maven-metadata.xml
       - file:/Users/ec2-user/Library/Android/sdk/extras/android/m2repository/com/github/prscX/photo-editor-android/master-SNAPSHOT/photo-editor-android-master-SNAPSHOT.pom
       - file:/Users/ec2-user/Library/Android/sdk/extras/android/m2repository/com/github/prscX/photo-editor-android/master-SNAPSHOT/photo-editor-android-master-SNAPSHOT.jar
       - https://dl.google.com/dl/android/maven2/com/github/prscX/photo-editor-android/master-SNAPSHOT/maven-metadata.xml
       - https://dl.google.com/dl/android/maven2/com/github/prscX/photo-editor-android/master-SNAPSHOT/photo-editor-android-master-SNAPSHOT.pom
       - https://dl.google.com/dl/android/maven2/com/github/prscX/photo-editor-android/master-SNAPSHOT/photo-editor-android-master-SNAPSHOT.jar
       - https://repo.maven.apache.org/maven2/com/github/prscX/photo-editor-android/master-SNAPSHOT/maven-metadata.xml
       - https://repo.maven.apache.org/maven2/com/github/prscX/photo-editor-android/master-SNAPSHOT/photo-editor-android-master-SNAPSHOT.pom
       - https://repo.maven.apache.org/maven2/com/github/prscX/photo-editor-android/master-SNAPSHOT/photo-editor-android-master-SNAPSHOT.jar
       - https://www.jitpack.io/com/github/prscX/photo-editor-android/master-SNAPSHOT/maven-metadata.xml
       - https://www.jitpack.io/com/github/prscX/photo-editor-android/master-SNAPSHOT/photo-editor-android-master-f5dc1ff4f3-1.pom
       - https://www.jitpack.io/com/github/prscX/photo-editor-android/master-SNAPSHOT/photo-editor-android-master-f5dc1ff4f3-1.jar
       - https://jcenter.bintray.com/com/github/prscX/photo-editor-android/master-SNAPSHOT/maven-metadata.xml
       - https://jcenter.bintray.com/com/github/prscX/photo-editor-android/master-SNAPSHOT/photo-editor-android-master-SNAPSHOT.pom
       - https://jcenter.bintray.com/com/github/prscX/photo-editor-android/master-SNAPSHOT/photo-editor-android-master-SNAPSHOT.jar
       - file:/Users/ec2-user/app-builder/STAGING/client/packages/app-standalone/node_modules/react-native-v8/dist/com/github/prscX/photo-editor-android/master-SNAPSHOT/maven-metadata.xml
       - file:/Users/ec2-user/app-builder/STAGING/client/packages/app-standalone/node_modules/react-native-v8/dist/com/github/prscX/photo-editor-android/master-SNAPSHOT/photo-editor-android-master-SNAPSHOT.pom
       - file:/Users/ec2-user/app-builder/STAGING/client/packages/app-standalone/node_modules/react-native-v8/dist/com/github/prscX/photo-editor-android/master-SNAPSHOT/photo-editor-android-master-SNAPSHOT.jar
       - file:/Users/ec2-user/app-builder/STAGING/client/packages/app-standalone/node_modules/v8-android/dist/com/github/prscX/photo-editor-android/master-SNAPSHOT/maven-metadata.xml
       - file:/Users/ec2-user/app-builder/STAGING/client/packages/app-standalone/node_modules/v8-android/dist/com/github/prscX/photo-editor-android/master-SNAPSHOT/photo-editor-android-master-SNAPSHOT.pom
       - file:/Users/ec2-user/app-builder/STAGING/client/packages/app-standalone/node_modules/v8-android/dist/com/github/prscX/photo-editor-android/master-SNAPSHOT/photo-editor-android-master-SNAPSHOT.jar
       - file:/Users/ec2-user/app-builder/STAGING/client/node_modules/detox/Detox-android/com/github/prscX/photo-editor-android/master-SNAPSHOT/maven-metadata.xml
       - file:/Users/ec2-user/app-builder/STAGING/client/node_modules/detox/Detox-android/com/github/prscX/photo-editor-android/master-SNAPSHOT/photo-editor-android-master-SNAPSHOT.pom
       - file:/Users/ec2-user/app-builder/STAGING/client/node_modules/detox/Detox-android/com/github/prscX/photo-editor-android/master-SNAPSHOT/photo-editor-android-master-SNAPSHOT.jar
       - https://maven.fabric.io/public/com/github/prscX/photo-editor-android/master-SNAPSHOT/maven-metadata.xml
       - https://maven.fabric.io/public/com/github/prscX/photo-editor-android/master-SNAPSHOT/photo-editor-android-master-SNAPSHOT.pom
       - https://maven.fabric.io/public/com/github/prscX/photo-editor-android/master-SNAPSHOT/photo-editor-android-master-SNAPSHOT.jar
     Required by:
         project :app > project :react-native-photo-editor

* Try:
Run with --stacktrace option to get the stack trace. Run with --info or --debug option to get more log output. Run with --scan to get full insights.

* Get more help at https://help.gradle.org

Deprecated Gradle features were used in this build, making it incompatible with Gradle 6.0.
Use '--warning-mode all' to show the individual deprecation warnings.
See https://docs.gradle.org/5.5/userguide/command_line_interface.html#sec:command_line_warnings

BUILD FAILED in 3s

Command failed with exit code 1 (EPERM): ./gradlew bundleRelease -x bundleReleaseJsAndAssets

FAILURE: Build failed with an exception.

* What went wrong:
Could not determine the dependencies of task ':app:preReleaseBuild'.
> Could not resolve all task dependencies for configuration ':app:releaseRuntimeClasspath'.
   > Could not find com.github.prscX:photo-editor-android:master-SNAPSHOT.
     Searched in the following locations:
       - file:/Users/ec2-user/Library/Android/sdk/extras/m2repository/com/github/prscX/photo-editor-android/master-SNAPSHOT/maven-metadata.xml
       - file:/Users/ec2-user/Library/Android/sdk/extras/m2repository/com/github/prscX/photo-editor-android/master-SNAPSHOT/photo-editor-android-master-SNAPSHOT.pom
       - file:/Users/ec2-user/Library/Android/sdk/extras/m2repository/com/github/prscX/photo-editor-android/master-SNAPSHOT/photo-editor-android-master-SNAPSHOT.jar
       - file:/Users/ec2-user/Library/Android/sdk/extras/google/m2repository/com/github/prscX/photo-editor-android/master-SNAPSHOT/maven-metadata.xml
       - file:/Users/ec2-user/Library/Android/sdk/extras/google/m2repository/com/github/prscX/photo-editor-android/master-SNAPSHOT/photo-editor-android-master-SNAPSHOT.pom
       - file:/Users/ec2-user/Library/Android/sdk/extras/google/m2repository/com/github/prscX/photo-editor-android/master-SNAPSHOT/photo-editor-android-master-SNAPSHOT.jar
       - file:/Users/ec2-user/Library/Android/sdk/extras/android/m2repository/com/github/prscX/photo-editor-android/master-SNAPSHOT/maven-metadata.xml
       - file:/Users/ec2-user/Library/Android/sdk/extras/android/m2repository/com/github/prscX/photo-editor-android/master-SNAPSHOT/photo-editor-android-master-SNAPSHOT.pom
       - file:/Users/ec2-user/Library/Android/sdk/extras/android/m2repository/com/github/prscX/photo-editor-android/master-SNAPSHOT/photo-editor-android-master-SNAPSHOT.jar
       - https://dl.google.com/dl/android/maven2/com/github/prscX/photo-editor-android/master-SNAPSHOT/maven-metadata.xml
       - https://dl.google.com/dl/android/maven2/com/github/prscX/photo-editor-android/master-SNAPSHOT/photo-editor-android-master-SNAPSHOT.pom
       - https://dl.google.com/dl/android/maven2/com/github/prscX/photo-editor-android/master-SNAPSHOT/photo-editor-android-master-SNAPSHOT.jar
       - https://repo.maven.apache.org/maven2/com/github/prscX/photo-editor-android/master-SNAPSHOT/maven-metadata.xml
       - https://repo.maven.apache.org/maven2/com/github/prscX/photo-editor-android/master-SNAPSHOT/photo-editor-android-master-SNAPSHOT.pom
       - https://repo.maven.apache.org/maven2/com/github/prscX/photo-editor-android/master-SNAPSHOT/photo-editor-android-master-SNAPSHOT.jar
       - https://www.jitpack.io/com/github/prscX/photo-editor-android/master-SNAPSHOT/maven-metadata.xml
       - https://www.jitpack.io/com/github/prscX/photo-editor-android/master-SNAPSHOT/photo-editor-android-master-f5dc1ff4f3-1.pom
       - https://www.jitpack.io/com/github/prscX/photo-editor-android/master-SNAPSHOT/photo-editor-android-master-f5dc1ff4f3-1.jar
       - https://jcenter.bintray.com/com/github/prscX/photo-editor-android/master-SNAPSHOT/maven-metadata.xml
       - https://jcenter.bintray.com/com/github/prscX/photo-editor-android/master-SNAPSHOT/photo-editor-android-master-SNAPSHOT.pom
       - https://jcenter.bintray.com/com/github/prscX/photo-editor-android/master-SNAPSHOT/photo-editor-android-master-SNAPSHOT.jar
       - file:/Users/ec2-user/app-builder/STAGING/client/packages/app-standalone/node_modules/react-native-v8/dist/com/github/prscX/photo-editor-android/master-SNAPSHOT/maven-metadata.xml
       - file:/Users/ec2-user/app-builder/STAGING/client/packages/app-standalone/node_modules/react-native-v8/dist/com/github/prscX/photo-editor-android/master-SNAPSHOT/photo-editor-android-master-SNAPSHOT.pom
       - file:/Users/ec2-user/app-builder/STAGING/client/packages/app-standalone/node_modules/react-native-v8/dist/com/github/prscX/photo-editor-android/master-SNAPSHOT/photo-editor-android-master-SNAPSHOT.jar
       - file:/Users/ec2-user/app-builder/STAGING/client/packages/app-standalone/node_modules/v8-android/dist/com/github/prscX/photo-editor-android/master-SNAPSHOT/maven-metadata.xml
       - file:/Users/ec2-user/app-builder/STAGING/client/packages/app-standalone/node_modules/v8-android/dist/com/github/prscX/photo-editor-android/master-SNAPSHOT/photo-editor-android-master-SNAPSHOT.pom
       - file:/Users/ec2-user/app-builder/STAGING/client/packages/app-standalone/node_modules/v8-android/dist/com/github/prscX/photo-editor-android/master-SNAPSHOT/photo-editor-android-master-SNAPSHOT.jar
       - file:/Users/ec2-user/app-builder/STAGING/client/node_modules/detox/Detox-android/com/github/prscX/photo-editor-android/master-SNAPSHOT/maven-metadata.xml
       - file:/Users/ec2-user/app-builder/STAGING/client/node_modules/detox/Detox-android/com/github/prscX/photo-editor-android/master-SNAPSHOT/photo-editor-android-master-SNAPSHOT.pom
       - file:/Users/ec2-user/app-builder/STAGING/client/node_modules/detox/Detox-android/com/github/prscX/photo-editor-android/master-SNAPSHOT/photo-editor-android-master-SNAPSHOT.jar
       - https://maven.fabric.io/public/com/github/prscX/photo-editor-android/master-SNAPSHOT/maven-metadata.xml
       - https://maven.fabric.io/public/com/github/prscX/photo-editor-android/master-SNAPSHOT/photo-editor-android-master-SNAPSHOT.pom
       - https://maven.fabric.io/public/com/github/prscX/photo-editor-android/master-SNAPSHOT/photo-editor-android-master-SNAPSHOT.jar
     Required by:
         project :app > project :react-native-photo-editor

* Try:
Run with --stacktrace option to get the stack trace. Run with --info or --debug option to get more log output. Run with --scan to get full insights.

* Get more help at https://help.gradle.org

BUILD FAILED in 3s

Error: Command failed with exit code 1 (EPERM): ./gradlew bundleRelease -x bundleReleaseJsAndAssets
    at makeError (/Users/ec2-user/app-builder/STAGING/client/node_modules/rnv/node_modules/execa/lib/error.js:58:11)
    at handlePromise (/Users/ec2-user/app-builder/STAGING/client/node_modules/rnv/node_modules/execa/index.js:112:26)
    at processTicksAndRejections (node:internal/process/task_queues:96:5)

│                                                                              │
│  Project location:                                                           │
│  ./platformBuilds/app_423059_android                                         │
└──────────────────────────────────────────────────────────────────────────────┘
exec: 3:42.972 (m:ss.mmm)
remove temp package: 2.365ms
ypx: 3:43.084 (m:ss.mmm)

Also getting this error, along with a ton of others on Android.

The iOS standalone compiled without issue, but have tried every Android build version and combination APK/AAB/3.3.3/3.4.4/3.2.15, all with errors… :-0

Runtime version: 3.4.4; AB version: 0.2.50 COMMAND: dockerrun --rm -v /tmp/296762-android:/app:z -v /home/ec2-user/.npmrc:/opt/android-sdk-linux/.npmrc android bash -c ‘rnv export -p android -s standalone -c standalone --ci --yes --skipRnvCheck --packageManager yarn --template @appgyver/orchestra-template-standalone@3.4.4’ FAILED with ERROR: FAILURE: Build failed with an exception. * What went wrong: Could not determine the dependencies of task ‘:app:lintVitalRelease’. > Could not resolve all artifacts for configuration ‘:app:debugRuntimeClasspath’. > Could not find com.github.prscX:photo-editor-android:master-SNAPSHOT. Searched in the following locations: - https://dl.google.com/dl/android/maven2/com/github/prscX/photo-editor-android/master-SNAPSHOT/maven-metadata.xml - https://dl.google.com/dl/android/maven2/com/github/prscX/photo-editor-android/master-SNAPSHOT/photo-editor-android-master-SNAPSHOT.pom - https://repo.maven.apache.org/maven2/com/github/prscX/photo-editor-android/master-SNAPSHOT/maven-metadata.xml - https://repo.maven.apache.org/maven2/com/github/prscX/photo-editor-android/master-SNAPSHOT/photo-editor-android-master-SNAPSHOT.pom - https://www.jitpack.io/com/github/prscX/photo-editor-android/master-SNAPSHOT/maven-metadata.xml - https://www.jitpack.io/com/github/prscX/photo-editor-android/master-SNAPSHOT/photo-editor-android-master-f5dc1ff4f3-1.pom - https://jcenter.bintray.com/com/github/prscX/photo-editor-android/master-SNAPSHOT/maven-metadata.xml - https://jcenter.bintray.com/com/github/prscX/photo-editor-android/master-SNAPSHOT/photo-editor-android-master-SNAPSHOT.pom - file:/app/node_modules/react-native-v8/dist/com/github/prscX/photo-editor-android/master-SNAPSHOT/maven-metadata.xml - file:/app/node_modules/react-native-v8/dist/com/github/prscX/photo-editor-android/master-SNAPSHOT/photo-editor-android-master-SNAPSHOT.pom - file:/app/node_modules/v8-android/dist/com/github/prscX/photo-editor-android/master-SNAPSHOT/maven-metadata.xml - file:/app/node_modules/v8-android/dist/com/github/prscX/photo-editor-android/master-SNAPSHOT/photo-editor-android-master-SNAPSHOT.pom - file:/app/node_modules/detox/Detox-android/com/github/prscX/photo-editor-android/master-SNAPSHOT/maven-metadata.xml - file:/app/node_modules/detox/Detox-android/com/github/prscX/photo-editor-android/master-SNAPSHOT/photo-editor-android-master-SNAPSHOT.pom - https://maven.fabric.io/public/com/github/prscX/photo-editor-android/master-SNAPSHOT/maven-metadata.xml - https://maven.fabric.io/public/com/github/prscX/photo-editor-android/master-SNAPSHOT/photo-editor-android-master-SNAPSHOT.pom Required by: project :app > project :react-native-photo-editor * Try: Run with --stacktrace option to get the stack trace. Run with --info or --debug option to get more log output. Run with --scan to get full insights. * Get more help at https://help.gradle.org BUILD FAILED in 2m 8s Deprecated Gradle features were used in this build, making it incompatible with Gradle 7.0. Use ‘–warning-mode all’ to show the individual deprecation warnings. See Command-Line Interface Command failed with exit code 1 (EPERM): ./gradlew assembleRelease -x bundleReleaseJsAndAssets Warning: Mapping new ns http://schemas.android.com/repository/android/common/02 to old ns http://schemas.android.com/repository/android/common/01 Warning: Mapping new ns http://schemas.android.com/repository/android/generic/02 to old ns http://schemas.android.com/repository/android/generic/01 Warning: Mapping new ns http://schemas.android.com/sdk/android/repo/addon2/02 to old ns http://schemas.android.com/sdk/android/repo/addon2/01 Warning: Mapping new ns http://schemas.android.com/sdk/android/repo/repository2/02 to old ns http://schemas.android.com/sdk/android/repo/repository2/01 Warning: Mapping new ns http://schemas.android.com/sdk/android/repo/sys-img2/02 to old ns http://schemas.android.com/sdk/android/repo/sys-img2/01 FAILURE: Build failed with an exception. * What went wrong: Could not determine the dependencies of task ‘:app:lintVitalRelease’. > Could not resolve all artifacts for configuration ‘:app:debugRuntimeClasspath’. > Could not find com.github.prscX:photo-editor-android:master-SNAPSHOT. Searched in the following locations: - https://dl.google.com/dl/android/maven2/com/github/prscX/photo-editor-android/master-SNAPSHOT/maven-metadata.xml - https://dl.google.com/dl/android/maven2/com/github/prscX/photo-editor-android/master-SNAPSHOT/photo-editor-android-master-SNAPSHOT.pom - https://repo.maven.apache.org/maven2/com/github/prscX/photo-editor-android/master-SNAPSHOT/maven-metadata.xml - https://repo.maven.apache.org/maven2/com/github/prscX/photo-editor-android/master-SNAPSHOT/photo-editor-android-master-SNAPSHOT.pom - https://www.jitpack.io/com/github/prscX/photo-editor-android/master-SNAPSHOT/maven-metadata.xml - https://www.jitpack.io/com/github/prscX/photo-editor-android/master-SNAPSHOT/photo-editor-android-master-f5dc1ff4f3-1.pom - https://jcenter.bintray.com/com/github/prscX/photo-editor-android/master-SNAPSHOT/maven-metadata.xml - https://jcenter.bintray.com/com/github/prscX/photo-editor-android/master-SNAPSHOT/photo-editor-android-master-SNAPSHOT.pom - file:/app/node_modules/react-native-v8/dist/com/github/prscX/photo-editor-android/master-SNAPSHOT/maven-metadata.xml - file:/app/node_modules/react-native-v8/dist/com/github/prscX/photo-editor-android/master-SNAPSHOT/photo-editor-android-master-SNAPSHOT.pom - file:/app/node_modules/v8-android/dist/com/github/prscX/photo-editor-android/master-SNAPSHOT/maven-metadata.xml - file:/app/node_modules/v8-android/dist/com/github/prscX/photo-editor-android/master-SNAPSHOT/photo-editor-android-master-SNAPSHOT.pom - file:/app/node_modules/detox/Detox-android/com/github/prscX/photo-editor-android/master-SNAPSHOT/maven-metadata.xml - file:/app/node_modules/detox/Detox-android/com/github/prscX/photo-editor-android/master-SNAPSHOT/photo-editor-android-master-SNAPSHOT.pom - https://maven.fabric.io/public/com/github/prscX/photo-editor-android/master-SNAPSHOT/maven-metadata.xml - https://maven.fabric.io/public/com/github/prscX/photo-editor-android/master-SNAPSHOT/photo-editor-android-master-SNAPSHOT.pom Required by: project :app > project :react-native-photo-editor * Try: Run with --stacktrace option to get the stack trace. Run with --info or --debug option to get more log output. Run with --scan to get full insights. * Get more help at https://help.gradle.org BUILD FAILED in 2m 8s Error: Command failed with exit code 1 (EPERM): ./gradlew assembleRelease -x bundleReleaseJsAndAssets at makeError (/app/node_modules/rnv/node_modules/execa/lib/error.js:58:11) at handlePromise (/app/node_modules/rnv/node_modules/execa/index.js:112:26) at runMicrotasks () at processTicksAndRejections (node:internal/process/task_queues:96:5) │ │ │ Project location: │ │ ./platformBuilds/standalone_android │

Ok, solved it by uninstalling the “open rich text editor” flow function component. It wasn’t in use, but was in my library…