Build failed for web application

App ID: 501319

Hi,
When trying to deploy my web app, I get the following error log:

Runtime version: 4.6.22;
AB version: 1.7.8
COMMAND:

/usr/local/lib/node_modules/@appgyver/orchestra-builder/node_modules/rnv/bin/index.jsconfigure -p web -s standalone -c standalone --ci --yes --skipRnvCheck --packageManager yarn --template @appgyver/orchestra-template-standalone@4.6.22 --hooks --npxMode

FAILED with ERROR:

│ [ error ] COMMAND:
yarn add @appgyver/orchestra-template-standalone@4.6.22
FAILED with ERROR:
throw new (_errors || _load_errors()).ResponseError(_this3.reporter.lang(‘requestFailed’, description), res.statusCode);
^
ResponseError: Request failed “503 Service Unavailable”
at ResponseError.ExtendableBuiltin (/usr/local/lib/node_modules/yarn/lib/cli.js:696:66)
at new ResponseError (/usr/local/lib/node_modules/yarn/lib/cli.js:802:124)
at Request.params.callback [as _callback] (/usr/local/lib/node_modules/yarn/lib/cli.js:67006:19)
at Request.self.callback (/usr/local/lib/node_modules/yarn/lib/cli.js:140883:22)
at Request.emit (events.js:400:28)
at Request. (/usr/local/lib/node_modules/yarn/lib/cli.js:141855:10)
at Request.emit (events.js:400:28)
throw new (_errors || _load_errors()).ResponseError(_this3.reporter.lang(‘requestFailed’, description), res.statusCode);
^
ResponseError: Request failed “503 Service Unavailable”
at ResponseError.ExtendableBuiltin (/usr/local/lib/node_modules/yarn/lib/cli.js:696:66)
at new ResponseError (/usr/local/lib/node_modules/yarn/lib/cli.js:802:124)
at Request.params.callback [as _callback] (/usr/local/lib/node_modules/yarn/lib/cli.js:67006:19)
at Request.self.callback (/usr/local/lib/node_modules/yarn/lib/cli.js:140883:22)
at Request.emit (events.js:400:28)
at Request. (/usr/local/lib/node_modules/yarn/lib/cli.js:141855:10)
at Request.emit (events.js:400:28)
throw new (_errors || _load_errors()).ResponseError(_this3.reporter.lang(‘requestFailed’, description), res.statusCode);
^
ResponseError: Request failed “503 Service Unavailable”
at ResponseError.ExtendableBuiltin (/usr/local/lib/node_modules/yarn/lib/cli.js:696:66)
at new ResponseError (/usr/local/lib/node_modules/yarn/lib/cli.js:802:124)
at Request.params.callback [as _callback] (/usr/local/lib/node_modules/yarn/lib/cli.js:67006:19)
at Request.self.callback (/usr/local/lib/node_modules/yarn/lib/cli.js:140883:22)
at Request.emit (events.js:400:28)
at Request. (/usr/local/lib/node_modules/yarn/lib/cli.js:141855:10)
at Request.emit (events.js:400:28)
Error: Command failed with exit code 1: yarn add @appgyver/orchestra-template-standalone@4.6.22
warning package.json: No license field
warning No license field
/usr/local/lib/node_modules/yarn/lib/cli.js:67006
throw new (_errors || _load_errors()).ResponseError(_this3.reporter.lang(‘requestFailed’, description), res.statusCode);
^
ResponseError: Request failed “503 Service Unavailable”
at ResponseError.ExtendableBuiltin (/usr/local/lib/node_modules/yarn/lib/cli.js:696:66)
at new ResponseError (/usr/local/lib/node_modules/yarn/lib/cli.js:802:124)
at Request.params.callback [as _callback] (/usr/local/lib/node_modules/yarn/lib/cli.js:67006:19)
at Request.self.callback (/usr/local/lib/node_modules/yarn/lib/cli.js:140883:22)
at Request.emit (events.js:400:28)
at Request. (/usr/local/lib/node_modules/yarn/lib/cli.js:141855:10)
at Request.emit (events.js:400:28)
at makeError (/usr/local/lib/node_modules/@appgyver/orchestra-builder/node_modules/execa/lib/error.js:60:11)
at handlePromise (/usr/local/lib/node_modules/@appgyver/orchestra-builder/node_modules/execa/index.js:118:26)
at processTicksAndRejections (internal/process/task_queues.js:95:5)
│ │
└──────────────────────────────────────────────────────────────────────────────┘

Is this a bug or is there anything I can do?

Thanks!

In an identical attempt a few minutes earlier, I got the following error:

Runtime version: 4.6.22;
AB version: 1.7.6
COMMAND:

/usr/local/lib/node_modules/@appgyver/orchestra-builder/node_modules/rnv/bin/index.jsconfigure -p web -s standalone -c standalone --ci --yes --skipRnvCheck --packageManager yarn --template @appgyver/orchestra-template-standalone@4.6.22 --hooks --npxMode

FAILED with ERROR:

│ [ error ] COMMAND:
yarn add @appgyver/orchestra-template-standalone@4.6.22
FAILED with ERROR:
error An unexpected error occurred: “https://npm.pkg.github.com/@appgyver%2Forchestra-template-standalone: ESOCKETTIMEDOUT”.
info If you think this is a bug, please open a bug report with the information provided in “/tmp/604067-web-258818/yarn-error.log”.
info Visit yarn add | Yarn for documentation about this command.
Command failed with exit code 1: yarn add @appgyver/orchestra-template-standalone@4.6.22
warning package.json: No license field
warning No license field
error An unexpected error occurred: “https://npm.pkg.github.com/@appgyver%2Forchestra-template-standalone: ESOCKETTIMEDOUT”.
yarn add v1.22.17
info No lockfile found.
[1/4] Resolving packages…
info There appears to be trouble with your network connection. Retrying…
info There appears to be trouble with your network connection. Retrying…
info If you think this is a bug, please open a bug report with the information provided in “/tmp/604067-web-258818/yarn-error.log”.
info Visit yarn add | Yarn for documentation about this command.
warning package.json: No license field
warning No license field
error An unexpected error occurred: “https://npm.pkg.github.com/@appgyver%2Forchestra-template-standalone: ESOCKETTIMEDOUT”.
Error: Command failed with exit code 1: yarn add @appgyver/orchestra-template-standalone@4.6.22
warning package.json: No license field
warning No license field
error An unexpected error occurred: “https://npm.pkg.github.com/@appgyver%2Forchestra-template-standalone: ESOCKETTIMEDOUT”.
yarn add v1.22.17
info No lockfile found.
[1/4] Resolving packages…
info There appears to be trouble with your network connection. Retrying…
info There appears to be trouble with your network connection. Retrying…
info If you think this is a bug, please open a bug report with the information provided in “/tmp/604067-web-258818/yarn-error.log”.
info Visit yarn add | Yarn for documentation about this command.
at makeError (/usr/local/lib/node_modules/@appgyver/orchestra-builder/node_modules/execa/lib/error.js:60:11)
at handlePromise (/usr/local/lib/node_modules/@appgyver/orchestra-builder/node_modules/execa/index.js:118:26)
at processTicksAndRejections (internal/process/task_queues.js:95:5)
│ │
└──────────────────────────────────────────────────────────────────────────────┘