Hi, newbie here, i tried to build my app but it says error

BUILD FAILED in 45s

Command failed with exit code 1 (EPERM): ./gradlew bundleRelease -x bundleReleaseJsAndAssets

FAILURE: Build failed with an exception.

  • Where:
    Build file ‘/Users/ec2-user/app-builder/STAGING/client/node_modules/react-native-webview-bridge/android/build.gradle’ line: 38

  • What went wrong:
    A problem occurred evaluating project ‘:react-native-webview-bridge’.

Project with path ‘:react-native-webview’ could not be found in project ‘:react-native-webview-bridge’.

  • Try:
    Run with --stacktrace option to get the stack trace. Run with --info or --debug option to get more log output. Run with --scan to get full insights.

  • Get more help at https://help.gradle.org

BUILD FAILED in 45s

Error: Command failed with exit code 1 (EPERM): ./gradlew bundleRelease -x bundleReleaseJsAndAssets
at makeError (/Users/ec2-user/app-builder/STAGING/client/node_modules/rnv/node_modules/execa/lib/error.js:58:11)
at handlePromise (/Users/ec2-user/app-builder/STAGING/client/node_modules/rnv/node_modules/execa/index.js:112:26)
at runMicrotasks ()
at processTicksAndRejections (node:internal/process/task_queues:96:5)

│ │
│ Project location: │
│ ./platformBuilds/app_430386_android │
└──────────────────────────────────────────────────────────────────────────────┘
exec: 4:04.696 (m:ss.mmm)
remove temp package: 3.309ms
ypx: 4:04.812 (m:ss.mmm)

this is what shows up at the end of the error log. can anyone tell me how to fix this? thank you

See

Hi! I actually found the thread earlier and have resolved the issue by putting a hidden “web view” component on a page just as you said. Thank you for taking the time to reply here, we really appreciate it.

I put it on they first page (in my case the login page)… Maybe it’s that.