I'm getting error while building app

Runtime version: 4.1.6; AB version: 1.6.4 COMMAND: npxrnv export -p android -s standalone -c standalone --ci --yes --skipRnvCheck --packageManager yarn --template @appgyver/orchestra-template-standalone@4.1.6 -r FAILED with ERROR: FAILURE: Build failed with an exception. * What went wrong: Execution failed for task ‘:app:processReleaseGoogleServices’. > No matching client found for package name ‘com.ajstudio.app’ * Try: Run with --stacktrace option to get the stack trace. Run with --info or --debug option to get more log output. Run with --scan to get full insights. * Get more help at https://help.gradle.org BUILD FAILED in 32s Deprecated Gradle features were used in this build, making it incompatible with Gradle 7.0. Use ‘–warning-mode all’ to show the individual deprecation warnings. See Command-Line Interface 279 actionable tasks: 279 executed Command failed with exit code 1 (EPERM): ./gradlew assembleRelease -x bundleReleaseJsAndAssets Warning: Mapping new ns http://schemas.android.com/repository/android/common/02 to old ns http://schemas.android.com/repository/android/common/01 Warning: Mapping new ns http://schemas.android.com/repository/android/generic/02 to old ns http://schemas.android.com/repository/android/generic/01 Warning: Mapping new ns http://schemas.android.com/sdk/android/repo/addon2/02 to old ns http://schemas.android.com/sdk/android/repo/addon2/01 Warning: Mapping new ns http://schemas.android.com/sdk/android/repo/addon2/03 to old ns http://schemas.android.com/sdk/android/repo/addon2/01 Warning: Mapping new ns http://schemas.android.com/sdk/android/repo/repository2/02 to old ns http://schemas.android.com/sdk/android/repo/repository2/01 Warning: Mapping new ns http://schemas.android.com/sdk/android/repo/repository2/03 to old ns http://schemas.android.com/sdk/android/repo/repository2/01 Warning: Mapping new ns http://schemas.android.com/sdk/android/repo/sys-img2/03 to old ns http://schemas.android.com/sdk/android/repo/sys-img2/01 Warning: Mapping new ns http://schemas.android.com/sdk/android/repo/sys-img2/02 to old ns http://schemas.android.com/sdk/android/repo/sys-img2/01 Warning: Mapping new ns http://schemas.android.com/repository/android/common/02 to old ns http://schemas.android.com/repository/android/common/01 Warning: Mapping new ns http://schemas.android.com/repository/android/generic/02 to old ns http://schemas.android.com/repository/android/generic/01 Warning: Mapping new ns http://schemas.android.com/sdk/android/repo/addon2/02 to old ns http://schemas.android.com/sdk/android/repo/addon2/01 Warning: Mapping new ns http://schemas.android.com/sdk/android/repo/addon2/03 to old ns http://schemas.android.com/sdk/android/repo/addon2/01 Warning: Mapping new ns http://schemas.android.com/sdk/android/repo/repository2/02 to old ns http://schemas.android.com/sdk/android/repo/repository2/01 Warning: Mapping new ns http://schemas.android.com/sdk/android/repo/repository2/03 to old ns http://schemas.android.com/sdk/android/repo/repository2/01 Warning: Mapping new ns http://schemas.android.com/sdk/android/repo/sys-img2/03 to old ns http://schemas.android.com/sdk/android/repo/sys-img2/01 Warning: Mapping new ns http://schemas.android.com/sdk/android/repo/sys-img2/02 to old ns http://schemas.android.com/sdk/android/repo/sys-img2/01 Warning: unexpected element (uri:“”, local:“base-extension”). Expected elements are <{}codename>,<{}layoutlib>,<{}api-level> Note: Some input files use or override a deprecated API. Note: Recompile with -Xlint:deprecation for details. Note: /tmp/503822-android-229350/node_modules/@react-native-firebase/auth/android/src/main/java/io/invertase/firebase/auth/ReactNativeFirebaseAuthModule.java uses or overrides a deprecated API. Note: Recompile with -Xlint:deprecation for details. Note: /tmp/503822-android-229350/node_modules/@react-native-firebase/crashlytics/android/src/main/java/io/invertase/firebase/crashlytics/ReactNativeFirebaseCrashlyticsModule.java uses or overrides a deprecated API. Note: Recompile with -Xlint:deprecation for details. FAILURE: Build failed with an exception. * What went wrong: Execution failed for task ‘:app:processReleaseGoogleServices’. > No matching client found for package name ‘com.ajstudio.app’ * Try: Run with --stacktrace option to get the stack trace. Run with --info or --debug option to get more log output. Run with --scan to get full insights. * Get more help at https://help.gradle.org BUILD FAILED in 32s Error: Command failed with exit code 1 (EPERM): ./gradlew assembleRelease -x bundleReleaseJsAndAssets at makeError (/tmp/503822-android-229350/node_modules/rnv/node_modules/execa/lib/error.js:58:11) at handlePromise (/tmp/503822-android-229350/node_modules/rnv/node_modules/execa/index.js:112:26) at processTicksAndRejections (internal/process/task_queues.js:95:5) │ │ │ Project location: │ │ ./platformBuilds/standalone_android │

Check if you have the same “package name” in Firebase and the Appgyver build configuration… My thought is based on this part: