iOS build keeps failing; not sure how to troubleshoot the error messages i'm receiving

Are you having issues with building your app? We’re here to help!

Before posting:
:white_check_mark: - Take a look at the build log included in the email you received from us to find out more about why your build failed
:white_check_mark: - Double-check that you have generated all required assets correctly: Build and Distribute your App

If you’re unable to resolve the issue, please include your app ID and the runtime version you are building with in your post, so we can investigate further.

App ID: 424112
Runtime Version: 4.5.10

please help … thanks! I’m including the error messages received below:

AB version: 1.7.6 COMMAND: ASSETS_ARCHIVE_URL=https://appgyver-meap-assets.s3.amazonaws.com/jeggzy9fqh21c9uidy0d8xj7576f?response-content-disposition=attachment%3B%20filename%3D"assets.zip"%3B%20filename*%3DUTF-8’'assets.zip&response-content-type=application%2Fzip&X-Amz-Algorithm=AWS4-HMAC-SHA256&X-Amz-Credential=AKIAJJSXXQRL4UNGBAXQ%2F20220903%2Fus-east-1%2Fs3%2Faws4_request&X-Amz-Date=20220903T202234Z&X-Amz-Expires=172800&X-Amz-SignedHeaders=host&X-Amz-Signature=558776b7071b5f6529033031eb48c1d484fad556bc02bffdf4881c83c33a44cc npxrnv export -p ios -s standalone_appstore -c standalone --ci --yes --skipRnvCheck --packageManager yarn --template @appgyver/orchestra-template-standalone@4.5.10 -r --xcodebuildArchiveArgs “OTHER_CODE_SIGN_FLAGS="–keychain\ AppGyver-526554"” FAILED with ERROR: │ [ error ] [export] COMMAND: xcodebuildOTHER_CODE_SIGN_FLAGS=–keychain AppGyver-526554 -workspace /private/var/folders/pf/p5g2vb2j0yx1x6vlmxdppc700000gn/T/526554-ios-241948/platformBuilds/standalone_ios/RNVApp.xcworkspace -scheme RNVApp -sdk iphoneos -configuration Release archive -archivePath /private/var/folders/pf/p5g2vb2j0yx1x6vlmxdppc700000gn/T/526554-ios-241948/platformBuilds/standalone_ios/release/RNVApp.xcarchive FAILED with ERROR: error: No signing certificate “iOS Distribution” found: No “iOS Distribution” signing certificate matching team ID “" with a private key was found. (in target ‘RNVApp’ from project ‘RNVApp’) ** ARCHIVE FAILED ** Command failed with exit code 65: xcodebuild OTHER_CODE_SIGN_FLAGS=–keychain AppGyver-526554 -workspace /private/var/folders/pf/p5g2vb2j0yx1x6vlmxdppc700000gn/T/526554-ios-241948/platformBuilds/standalone_ios/RNVApp.xcworkspace -scheme RNVApp -sdk iphoneos -configuration Release archive -archivePath /private/var/folders/pf/p5g2vb2j0yx1x6vlmxdppc700000gn/T/526554-ios-241948/platformBuilds/standalone_ios/release/RNVApp.xcarchive — xcodebuild: WARNING: Using the first of multiple matching destinations: { platform:iOS, id:dvtdevice-DVTiPhonePlaceholder-iphoneos:placeholder, name:Any iOS Device } { platform:iOS Simulator, id:dvtdevice-DVTiOSDeviceSimulatorPlaceholder-iphonesimulator:placeholder, name:Any iOS Simulator Device } error: No signing certificate “iOS Distribution” found: No “iOS Distribution” signing certificate matching team ID " ********** " with a private key was found. (in target ‘RNVApp’ from project ‘RNVApp’) — xcodebuild: WARNING: Using the first of multiple matching destinations: { platform:iOS, id:dvtdevice-DVTiPhonePlaceholder-iphoneos:placeholder, name:Any iOS Device } { platform:iOS Simulator, id:dvtdevice-DVTiOSDeviceSimulatorPlaceholder-iphonesimulator:placeholder, name:Any iOS Simulator Device } { platform:iOS Simulator, id:7930E789-42C8-4940-91B2-687D7BC95DD1, OS:15.2, name:iPad (9th generation) } { platform:iOS Simulator, id:342403C4-F663-4E78-8BD6-22220F8446ED, OS:15.2, name:iPad Air (4th generation) } Error: Command failed with exit code 65: xcodebuild OTHER_CODE_SIGN_FLAGS=–keychain AppGyver-526554 -workspace /private/var/folders/pf/p5g2vb2j0yx1x6vlmxdppc700000gn/T/526554-ios-241948/platformBuilds/standalone_ios/RNVApp.xcworkspace -scheme RNVApp -sdk iphoneos -configuration Release archive -archivePath /private/var/folders/pf/p5g2vb2j0yx1x6vlmxdppc700000gn/T/526554-ios-241948/platformBuilds/standalone_ios/release/RNVApp.xcarchive — xcodebuild: WARNING: Using the first of multiple matching destinations: { platform:iOS, id:dvtdevice-DVTiPhonePlaceholder-iphoneos:placeholder, name:Any iOS Device } { platform:iOS Simulator, id:dvtdevice-DVTiOSDeviceSimulatorPlaceholder-iphonesimulator:placeholder, name:Any iOS Simulator Device } { platform:iOS Simulator, id:7930E789-42C8-4940-91B2-687D7BC95DD1, OS:15.2, name:iPad (9th generation) } { platform:iOS Simulator, id:342403C4-F663-4E78-8BD6-22220F8446ED, OS:15.2, name:iPad Air (4th generation) } error: No signing certificate “iOS Distribution” found: No “iOS Distribution” signing certificate matching team ID "” with a private key was found. (in target ‘RNVApp’ from project ‘RNVApp’) at makeError (/private/var/folders/pf/p5g2vb2j0yx1x6vlmxdppc700000gn/T/526554-ios-241948/node_modules/execa/lib/error.js:60:11) at handlePromise (/private/var/folders/pf/p5g2vb2j0yx1x6vlmxdppc700000gn/T/526554-ios-241948/node_modules/execa/index.js:118:26) at processTicksAndRejections (node:internal/process/task_queues:96:5) │ │ │ Project location: │ │ ./platformBuilds/standalone_ios/RNVApp.xcworkspace │

I’m getting the same build error. Seems to be an issue with the Asset Manager (or whatever it’s called.) I’ve tried removing all assets and adding them back, different types of assets (SVG, PNG, JPG, etc.) but I am still getting the same issue. Retrying the build now hoping it was maybe an issue with too much load or something last Friday.

EDIT: Yep, just completed fine haha. I would give it another try!

Yeah got it to work for me yesterday morning… finally! I restarted the process from scratch (removing and adding them back, just like you did). Glad it’s working for you as well!