New ios app build failed

Just built my first iOS app and did the build and got an error log failed.

Can anyone advise on this error:

Your build for application SC Computer Services ended up failing.

We detected at least the following error in the build:

AB version: 1.6.2 COMMAND: npxrnv export -p ios -s standalone_appstore -c standalone --ci --yes --skipRnvCheck --packageManager yarn --template @appgyver/orchestra-template-standalone@4.3.6 -r --xcodebuildArchiveArgs “OTHER_CODE_SIGN_FLAGS=”–keychain\ AppGyver-508429"" FAILED with ERROR: │ [ error ] [export] COMMAND: xcodebuildOTHER_CODE_SIGN_FLAGS=–keychain AppGyver-508429 -workspace /private/var/folders/pf/p5g2vb2j0yx1x6vlmxdppc700000gn/T/508429-ios-222586/platformBuilds/standalone_ios/RNVApp.xcworkspace -scheme RNVApp -sdk iphoneos -configuration Release archive -archivePath /private/var/folders/pf/p5g2vb2j0yx1x6vlmxdppc700000gn/T/508429-ios-222586/platformBuilds/standalone_ios/release/RNVApp.xcarchive FAILED with ERROR: 2022-05-27 16:20:55.907 xcodebuild[49057:9457868] DVTProvisioningProfileManager: Failed to load profile “/Users/ec2-user/Library/MobileDevice/Provisioning Profiles/undefined.mobileprovision” (Error Domain=DVTProvisioningProfileProviderErrorDomain Code=1 “Failed to load profile.” UserInfo={NSLocalizedDescription=Failed to load profile., NSLocalizedRecoverySuggestion=Profile is missing the required UUID property.}) — xcodebuild: WARNING: Using the first of multiple matching destinations: { platform:iOS, id:dvtdevice-DVTiPhonePlaceholder-iphoneos:placeholder, name:Any iOS Device } { platform:iOS Simulator, id:dvtdevice-DVTiOSDeviceSimulatorPlaceholder-iphonesimulator:placeholder, name:Any iOS Simulator Device } { platform:iOS Simulator, id:7930E789-42C8-4940-91B2-687D7BC95DD1, OS:15.2, name:iPad (9th generation) } { platform:iOS Simulator, id:342403C4-F663-4E78-8BD6-22220F8446ED, OS:15.2, name:iPad Air (4th generation) } error: Signing for “RNVApp” requires a development team. Select a development team in the Signing & Capabilities editor that matches the selected profile “YOUR_PROVISIONING_PROFILE_NAME”. (in target ‘RNVApp’ from project ‘RNVApp’) ** ARCHIVE FAILED ** Command failed with exit code 65: xcodebuild OTHER_CODE_SIGN_FLAGS=–keychain AppGyver-508429 -workspace /private/var/folders/pf/p5g2vb2j0yx1x6vlmxdppc700000gn/T/508429-ios-222586/platformBuilds/standalone_ios/RNVApp.xcworkspace -scheme RNVApp -sdk iphoneos -configuration Release archive -archivePath /private/var/folders/pf/p5g2vb2j0yx1x6vlmxdppc700000gn/T/508429-ios-222586/platformBuilds/standalone_ios/release/RNVApp.xcarchive 2022-05-27 16:20:55.907 xcodebuild[49057:9457868] DVTProvisioningProfileManager: Failed to load profile “/Users/ec2-user/Library/MobileDevice/Provisioning Profiles/undefined.mobileprovision” (Error Domain=DVTProvisioningProfileProviderErrorDomain Code=1 “Failed to load profile.” UserInfo={NSLocalizedDescription=Failed to load profile., NSLocalizedRecoverySuggestion=Profile is missing the required UUID property.}) — xcodebuild: WARNING: Using the first of multiple matching destinations: { platform:iOS, id:dvtdevice-DVTiPhonePlaceholder-iphoneos:placeholder, name:Any iOS Device } { platform:iOS Simulator, id:dvtdevice-DVTiOSDeviceSimulatorPlaceholder-iphonesimulator:placeholder, name:Any iOS Simulator Device } { platform:iOS Simulator, id:7930E789-42C8-4940-91B2-687D7BC95DD1, OS:15.2, name:iPad (9th generation) } { platform:iOS Simulator, id:342403C4-F663-4E78-8BD6-22220F8446ED, OS:15.2, name:iPad Air (4th generation) } error: Signing for “RNVApp” requires a development team. Select a development team in the Signing & Capabilities editor that matches the selected profile “YOUR_PROVISIONING_PROFILE_NAME”. (in target ‘RNVApp’ from project ‘RNVApp’) 2022-05-27 16:20:55.907 xcodebuild[49057:9457868] DVTProvisioningProfileManager: Failed to load profile “/Users/ec2-user/Library/MobileDevice/Provisioning Profiles/undefined.mobileprovision” (Error Domain=DVTProvisioningProfileProviderErrorDomain Code=1 “Failed to load profile.” UserInfo={NSLocalizedDescription=Failed to load profile., NSLocalizedRecoverySuggestion=Profile is missing the required UUID property.}) — xcodebuild: WARNING: Using the first of multiple matching destinations: { platform:iOS, id:dvtdevice-DVTiPhonePlaceholder-iphoneos:placeholder, name:Any iOS Device } { platform:iOS Simulator, id:dvtdevice-DVTiOSDeviceSimulatorPlaceholder-iphonesimulator:placeholder, name:Any iOS Simulator Device } { platform:iOS Simulator, id:7930E789-42C8-4940-91B2-687D7BC95DD1, OS:15.2, name:iPad (9th generation) } { platform:iOS Simulator, id:342403C4-F663-4E78-8BD6-22220F8446ED, OS:15.2, name:iPad Air (4th generation) } Error: Command failed with exit code 65: xcodebuild OTHER_CODE_SIGN_FLAGS=–keychain AppGyver-508429 -workspace /private/var/folders/pf/p5g2vb2j0yx1x6vlmxdppc700000gn/T/508429-ios-222586/platformBuilds/standalone_ios/RNVApp.xcworkspace -scheme RNVApp -sdk iphoneos -configuration Release archive -archivePath /private/var/folders/pf/p5g2vb2j0yx1x6vlmxdppc700000gn/T/508429-ios-222586/platformBuilds/standalone_ios/release/RNVApp.xcarchive 2022-05-27 16:20:55.907 xcodebuild[49057:9457868] DVTProvisioningProfileManager: Failed to load profile “/Users/ec2-user/Library/MobileDevice/Provisioning Profiles/undefined.mobileprovision” (Error Domain=DVTProvisioningProfileProviderErrorDomain Code=1 “Failed to load profile.” UserInfo={NSLocalizedDescription=Failed to load profile., NSLocalizedRecoverySuggestion=Profile is missing the required UUID property.}) — xcodebuild: WARNING: Using the first of multiple matching destinations: { platform:iOS, id:dvtdevice-DVTiPhonePlaceholder-iphoneos:placeholder, name:Any iOS Device } { platform:iOS Simulator, id:dvtdevice-DVTiOSDeviceSimulatorPlaceholder-iphonesimulator:placeholder, name:Any iOS Simulator Device } { platform:iOS Simulator, id:7930E789-42C8-4940-91B2-687D7BC95DD1, OS:15.2, name:iPad (9th generation) } { platform:iOS Simulator, id:342403C4-F663-4E78-8BD6-22220F8446ED, OS:15.2, name:iPad Air (4th generation) } error: Signing for “RNVApp” requires a development team. Select a development team in the Signing & Capabilities editor that matches the selected profile “YOUR_PROVISIONING_PROFILE_NAME”. (in target ‘RNVApp’ from project ‘RNVApp’) at makeError (/private/var/folders/pf/p5g2vb2j0yx1x6vlmxdppc700000gn/T/508429-ios-222586/node_modules/execa/lib/error.js:60:11) at handlePromise (/private/var/folders/pf/p5g2vb2j0yx1x6vlmxdppc700000gn/T/508429-ios-222586/node_modules/execa/index.js:118:26) at processTicksAndRejections (node:internal/process/task_queues:96:5) │ │ │ Project location: │ │ ./platformBuilds/standalone_ios/RNVApp.xcworkspace │

Double check that you followed the instruction exactly to create your provisioning profile and certificate.

Thanks Phil, where would the details be for provisioning profile and certs?

thanks again

In the documentation.