Unknown android build error

Hi, I got an Android build error,
Anyone know how to solve?

I set key and settings well.
Is this probably because I set up 3rd party auth and didn’t connect the actual api?
I’ve just activated 3rd party auth. I just want to test it.

Runtime version: 4.5.10; AB version: 1.7.0 COMMAND: ASSETS_ARCHIVE_URL=https://blackgyver-meap-assets.s3.eu-west-1.amazonaws.com/ddj44q8oleoj2o42dm37wm619nhu?response-content-disposition=attachment%3B%20filename%3D"assets.zip"%3B%20filename*%3DUTF-8’'assets.zip&response-content-type=application%2Fzip&X-Amz-Algorithm=AWS4-HMAC-SHA256&X-Amz-Credential=AKIATG4VN3HFYKSVOEW2%2F20220804%2Feu-west-1%2Fs3%2Faws4_request&X-Amz-Date=20220804T080136Z&X-Amz-Expires=172800&X-Amz-SignedHeaders=host&X-Amz-Signature=2d9b0a2fb862586f208bd69c1970d406a9671fe1198ec101e87cce1189c84ce3 NODE_OPTIONS=–max-old-space-size=8096 npxrnv export -p android -s standalone -c standalone --ci --yes --skipRnvCheck --packageManager yarn --template @appgyver/orchestra-template-standalone@4.5.10 -r FAILED with ERROR: FAILURE: Build failed with an exception. * What went wrong: Could not determine the dependencies of task ‘:app:lintVitalRelease’. > Could not resolve all artifacts for configuration ‘:app:debugRuntimeClasspath’. > Could not find com.sap.cloud.android:foundation:4.0.0. Searched in the following locations: - https://www.jitpack.io/com/sap/cloud/android/foundation/4.0.0/foundation-4.0.0.pom - https://repo.maven.apache.org/maven2/com/sap/cloud/android/foundation/4.0.0/foundation-4.0.0.pom - https://dl.google.com/dl/android/maven2/com/sap/cloud/android/foundation/4.0.0/foundation-4.0.0.pom - JFrog - file:/tmp/80544-android-2945/node_modules/react-native-v8/dist/com/sap/cloud/android/foundation/4.0.0/foundation-4.0.0.pom - file:/tmp/80544-android-2945/node_modules/v8-android/dist/com/sap/cloud/android/foundation/4.0.0/foundation-4.0.0.pom - file:/tmp/80544-android-2945/node_modules/detox/Detox-android/com/sap/cloud/android/foundation/4.0.0/foundation-4.0.0.pom Required by: project :app > project :appgyver-react-native-sap-btp-mobile > Could not find com.sap.cloud.android:fiori:4.0.0. Searched in the following locations: - https://www.jitpack.io/com/sap/cloud/android/fiori/4.0.0/fiori-4.0.0.pom - https://repo.maven.apache.org/maven2/com/sap/cloud/android/fiori/4.0.0/fiori-4.0.0.pom - https://dl.google.com/dl/android/maven2/com/sap/cloud/android/fiori/4.0.0/fiori-4.0.0.pom - JFrog - file:/tmp/80544-android-2945/node_modules/react-native-v8/dist/com/sap/cloud/android/fiori/4.0.0/fiori-4.0.0.pom - file:/tmp/80544-android-2945/node_modules/v8-android/dist/com/sap/cloud/android/fiori/4.0.0/fiori-4.0.0.pom - file:/tmp/80544-android-2945/node_modules/detox/Detox-android/com/sap/cloud/android/fiori/4.0.0/fiori-4.0.0.pom Required by: project :app > project :appgyver-react-native-sap-btp-mobile > Could not find com.sap.cloud.android:onboarding:4.0.0. Searched in the following locations: - https://www.jitpack.io/com/sap/cloud/android/onboarding/4.0.0/onboarding-4.0.0.pom - file:/tmp/80544-android-2945/node_modules/v8-android/dist/com/sap/cloud/android/onboarding/4.0.0/onboarding-4.0.0.pom - file:/tmp/80544-android-2945/node_modules/detox/Detox-android/com/sap/cloud/android/onboarding/4.0.0/onboarding-4.0.0.pom Required by: project :app > project :appgyver-react-native-sap-btp-mobile > Could not find com.sap.cloud.android:flowsv2:4.0.0. Searched in the following locations: - https://www.jitpack.io/com/sap/cloud/android/flowsv2/4.0.0/flowsv2-4.0.0.pom - https://repo.maven.apache.org/maven2/com/sap/cloud/android/flowsv2/4.0.0/flowsv2-4.0.0.pom - https://dl.google.com/dl/android/maven2/com/sap/cloud/android/flowsv2/4.0.0/flowsv2-4.0.0.pom - JFrog - file:/tmp/80544-android-2945/node_modules/react-native-v8/dist/com/sap/cloud/android/flowsv2/4.0.0/flowsv2-4.0.0.pom - file:/tmp/80544-android-2945/node_modules/v8-android/dist/com/sap/cloud/android/flowsv2/4.0.0/flowsv2-4.0.0.pom - file:/tmp/80544-android-2945/node_modules/detox/Detox-android/com/sap/cloud/android/flowsv2/4.0.0/flowsv2-4.0.0.pom Required by: project :app > project :appgyver-react-native-sap-btp-mobile * Try: Run with --stacktrace option to get the stack trace. Run with --info or --debug option to get more log output. Run with --scan to get full insights. * Get more help at https://help.gradle.org Deprecated Gradle features were used in this build, making it incompatible with Gradle 7.0. Use ‘–warning-mode all’ to show the individual deprecation warnings. See Command-Line Interface BUILD FAILED in 17s Command failed with exit code 1: ./gradlew assembleRelease -x bundleReleaseJsAndAssets Warning: Mapping new ns http://schemas.android.com/repository/android/common/02 to old ns http://schemas.android.com/repository/android/common/01 Warning: Mapping new ns http://schemas.android.com/repository/android/generic/02 to old ns http://schemas.android.com/repository/android/generic/01 Warning: Mapping new ns http://schemas.android.com/sdk/android/repo/addon2/02 to old ns http://schemas.android.com/sdk/android/repo/addon2/01 Warning: Mapping new ns http://schemas.android.com/sdk/android/repo/addon2/03 to old ns http://schemas.android.com/sdk/android/repo/addon2/01 Warning: Mapping new ns http://schemas.android.com/sdk/android/repo/repository2/02 to old ns http://schemas.android.com/sdk/android/repo/repository2/01 Warning: Mapping new ns http://schemas.android.com/sdk/android/repo/repository2/03 to old ns http://schemas.android.com/sdk/android/repo/repository2/01 Warning: Mapping new ns http://schemas.android.com/sdk/android/repo/sys-img2/03 to old ns http://schemas.android.com/sdk/android/repo/sys-img2/01 Warning: Mapping new ns http://schemas.android.com/sdk/android/repo/sys-img2/02 to old ns http://schemas.android.com/sdk/android/repo/sys-img2/01 FAILURE: Build failed with an exception. * What went wrong: Could not determine the dependencies of task ‘:app:lintVitalRelease’. > Could not resolve all artifacts for configuration ‘:app:debugRuntimeClasspath’. > Could not find com.sap.cloud.android:foundation:4.0.0. Searched in the following locations: - https://www.jitpack.io/com/sap/cloud/android/foundation/4.0.0/foundation-4.0.0.pom - https://repo.maven.apache.org/maven2/com/sap/cloud/android/foundation/4.0.0/foundation-4.0.0.pom - https://dl.google.com/dl/android/maven2/com/sap/cloud/android/foundation/4.0.0/foundation-4.0.0.pom - JFrog - file:/tmp/80544-android-2945/node_modules/react-native-v8/dist/com/sap/cloud/android/foundation/4.0.0/foundation-4.0.0.pom - file:/tmp/80544-android-2945/node_modules/v8-android/dist/com/sap/cloud/android/foundation/4.0.0/foundation-4.0.0.pom - file:/tmp/80544-android-2945/node_modules/detox/Detox-android/com/sap/cloud/android/foundation/4.0.0/foundation-4.0.0.pom Required by: project :app > project :appgyver-react-native-sap-btp-mobile > Could not find com.sap.cloud.android:fiori:4.0.0. Searched in the following locations: - https://www.jitpack.io/com/sap/cloud/android/fiori/4.0.0/fiori-4.0.0.pom - https://repo.maven.apache.org/maven2/com/sap/cloud/android/fiori/4.0.0/fiori-4.0.0.pom - https://dl.google.com/dl/android/maven2/com/sap/cloud/android/fiori/4.0.0/fiori-4.0.0.pom - JFrog - file:/tmp/80544-android-2945/node_modules/react-native-v8/dist/com/sap/cloud/android/fiori/4.0.0/fiori-4.0.0.pom - file:/tmp/80544-android-2945/node_modules/v8-android/dist/com/sap/cloud/android/fiori/4.0.0/fiori-4.0.0.pom - file:/tmp/80544-android-2945/node_modules/detox/Detox-android/com/sap/cloud/android/fiori/4.0.0/fiori-4.0.0.pom Required by: project :app > project :appgyver-react-native-sap-btp-mobile > Could not find com.sap.cloud.android:onboarding:4.0.0. Searched in the following locations: - https://www.jitpack.io/com/sap/cloud/android/onboarding/4.0.0/onboarding-4.0.0.pom - https://repo.maven.apache.org/maven2/com/sap/cloud/android/onboarding/4.0.0/onboarding-4.0.0.pom - https://dl.google.com/dl/android/maven2/com/sap/cloud/android/onboarding/4.0.0/onboarding-4.0.0.pom - JFrog - file:/tmp/80544-android-2945/node_modules/react-native-v8/dist/com/sap/cloud/android/onboarding/4.0.0/onboarding-4.0.0.pom - file:/tmp/80544-android-2945/node_modules/v8-android/dist/com/sap/cloud/android/onboarding/4.0.0/onboarding-4.0.0.pom - file:/tmp/80544-android-2945/node_modules/detox/Detox-android/com/sap/cloud/android/onboarding/4.0.0/onboarding-4.0.0.pom Required by: project :app > project :appgyver-react-native-sap-btp-mobile > Could not find com.sap.cloud.android:flowsv2:4.0.0. Searched in the following locations: - https://www.jitpack.io/com/sap/cloud/android/flowsv2/4.0.0/flowsv2-4.0.0.pom - https://repo.maven.apache.org/maven2/com/sap/cloud/android/flowsv2/4.0.0/flowsv2-4.0.0.pom - https://dl.google.com/dl/android/maven2/com/sap/cloud/android/flowsv2/4.0.0/flowsv2-4.0.0.pom - JFrog - file:/tmp/80544-android-2945/node_modules/react-native-v8/dist/com/sap/cloud/android/flowsv2/4.0.0/flowsv2-4.0.0.pom - file:/tmp/80544-android-2945/node_modules/v8-android/dist/com/sap/cloud/android/flowsv2/4.0.0/flowsv2-4.0.0.pom - file:/tmp/80544-android-2945/node_modules/detox/Detox-android/com/sap/cloud/android/flowsv2/4.0.0/flowsv2-4.0.0.pom Required by: project :app > project :appgyver-react-native-sap-btp-mobile * Try: Run with --stacktrace option to get the stack trace. Run with --info or --debug option to get more log output. Run with --scan to get full insights. * Get more help at https://help.gradle.org BUILD FAILED in 17s Configuration on demand is an incubating feature. > Configure project :app Warning: The ‘kotlin-android-extensions’ Gradle plugin is deprecated. Please use this migration guide (Migrate from Kotlin synthetics to Jetpack view binding  |  Android Developers) to start working with View Binding (View Binding  |  Android Developers) and the ‘kotlin-parcelize’ plugin. Copying ZSSRichTextEditor html asset file from /tmp/80544-android-2945/node_modules/@appgyver/react-native-zss-rich-text-editor/src/editor.html to /tmp/80544-android-2945/platformBuilds/standalone_android/app/src/main/assets > Configure project :lottie-react-native WARNING:: The specified Android SDK Build Tools version (28.0.0) is ignored, as it is below the minimum supported version (30.0.2) for Android Gradle Plugin 4.2.2. Android SDK Build Tools 30.0.2 will be used. To suppress this warning, remove “buildToolsVersion ‘28.0.0’” from your build.gradle file, as each version of the Android Gradle Plugin now has a default version of the build tools. > Configure project :react-native-android-open-settings WARNING:: minSdkVersion (26) is greater than targetSdkVersion (22) for variant “debug”. Please change the values such that minSdkVersion is less than or equal to targetSdkVersion. WARNING:: minSdkVersion (26) is greater than targetSdkVersion (22) for variant “release”. Please change the values such that minSdkVersion is less than or equal to targetSdkVersion. > Configure project :react-native-dynamic-fonts WARNING:: Configuration ‘compile’ is obsolete and has been replaced with ‘implementation’ and ‘api’. It will be removed in version 7.0 of the Android Gradle plugin. For more information, see Cómo agregar dependencias de compilación  |  Desarrolladores de Android  |  Android Developers. > Configure project :react-native-exception-handler WARNING:: minSdkVersion (26) is greater than targetSdkVersion (22) for variant “debug”. Please change the values such that minSdkVersion is less than or equal to targetSdkVersion. WARNING:: minSdkVersion (26) is greater than targetSdkVersion (22) for variant “release”. Please change the values such that minSdkVersion is less than or equal to targetSdkVersion. > Configure project :react-native-image-resizer WARNING:: Configuration ‘compile’ is obsolete and has been replaced with ‘implementation’ and ‘api’. It will be removed in version 7.0 of the Android Gradle plugin. For more information, see Cómo agregar dependencias de compilación  |  Desarrolladores de Android  |  Android Developers. WARNING:: minSdkVersion (26) is greater than targetSdkVersion (23) for variant “debug”. Please change the values such that minSdkVersion is less than or equal to targetSdkVersion. WARNING:: minSdkVersion (26) is greater than targetSdkVersion (23) for variant “release”. Please change the values such that minSdkVersion is less than or equal to targetSdkVersion. > Configure project :react-native-linear-gradient WARNING:: Configuration ‘provided’ is obsolete and has been replaced with ‘compileOnly’. It will be removed in version 7.0 of the Android Gradle plugin. For more information, see Cómo agregar dependencias de compilación  |  Desarrolladores de Android  |  Android Developers. > Configure project :react-native-picker WARNING:: Configuration ‘compile’ is obsolete and has been replaced with ‘implementation’ and ‘api’. It will be removed in version 7.0 of the Android Gradle plugin. For more information, see Cómo agregar dependencias de compilación  |  Desarrolladores de Android  |  Android Developers. > Configure project :react-native-screens WARNING:: minSdkVersion (26) is greater than targetSdkVersion (22) for variant “debug”. Please change the values such that minSdkVersion is less than or equal to targetSdkVersion. WARNING:: minSdkVersion (26) is greater than targetSdkVersion (22) for variant “release”. Please change the values such that minSdkVersion is less than or equal to targetSdkVersion. > Configure project :react-native-simple-compass WARNING:: Configuration ‘compile’ is obsolete and has been replaced with ‘implementation’ and ‘api’. It will be removed in version 7.0 of the Android Gradle plugin. For more information, see Cómo agregar dependencias de compilación  |  Desarrolladores de Android  |  Android Developers. WARNING:: minSdkVersion (26) is greater than targetSdkVersion (22) for variant “debug”. Please change the values such that minSdkVersion is less than or equal to targetSdkVersion. WARNING:: minSdkVersion (26) is greater than targetSdkVersion (22) for variant “release”. Please change the values such that minSdkVersion is less than or equal to targetSdkVersion. > Configure project :react-native-simple-shadow-view WARNING:: minSdkVersion (26) is greater than targetSdkVersion (16) for variant “debug”. Please change the values such that minSdkVersion is less than or equal to targetSdkVersion. WARNING:: minSdkVersion (26) is greater than targetSdkVersion (16) for variant “release”. Please change the values such that minSdkVersion is less than or equal to targetSdkVersion. > Configure project :react-native-webrtc WARNING:: minSdkVersion (26) is greater than targetSdkVersion (23) for variant “debug”. Please change the values such that minSdkVersion is less than or equal to targetSdkVersion. WARNING:: minSdkVersion (26) is greater than targetSdkVersion (23) for variant “release”. Please change the values such that minSdkVersion is less than or equal to targetSdkVersion. > Configure project :react-native-webview-bridge WARNING:: Configuration ‘compile’ is obsolete and has been replaced with ‘implementation’ and ‘api’. It will be removed in version 7.0 of the Android Gradle plugin. For more information, see Cómo agregar dependencias de compilación  |  Desarrolladores de Android  |  Android Developers. WARNING:: minSdkVersion (26) is greater than targetSdkVersion (23) for variant “debug”. Please change the values such that minSdkVersion is less than or equal to targetSdkVersion. WARNING:: minSdkVersion (26) is greater than targetSdkVersion (23) for variant “release”. Please change the values such that minSdkVersion is less than or equal to targetSdkVersion. Deprecated Gradle features were used in this build, making it incompatible with Gradle 7.0. Use ‘–warning-mode all’ to show the individual deprecation warnings. See Command-Line Interface Warning: Mapping new ns http://schemas.android.com/repository/android/common/02 to old ns http://schemas.android.com/repository/android/common/01 Warning: Mapping new ns http://schemas.android.com/repository/android/generic/02 to old ns http://schemas.android.com/repository/android/generic/01 Warning: Mapping new ns http://schemas.android.com/sdk/android/repo/addon2/02 to old ns http://schemas.android.com/sdk/android/repo/addon2/01 Warning: Mapping new ns http://schemas.android.com/sdk/android/repo/addon2/03 to old ns http://schemas.android.com/sdk/android/repo/addon2/01 Warning: Mapping new ns http://schemas.android.com/sdk/android/repo/repository2/02 to old ns http://schemas.android.com/sdk/android/repo/repository2/01 Warning: Mapping new ns http://schemas.android.com/sdk/android/repo/repository2/03 to old ns http://schemas.android.com/sdk/android/repo/repository2/01 Warning: Mapping new ns http://schemas.android.com/sdk/android/repo/sys-img2/03 to old ns http://schemas.android.com/sdk/android/repo/sys-img2/01 Warning: Mapping new ns http://schemas.android.com/sdk/android/repo/sys-img2/02 to old ns http://schemas.android.com/sdk/android/repo/sys-img2/01 FAILURE: Build failed with an exception. * What went wrong: Could not determine the dependencies of task ‘:app:lintVitalRelease’. > Could not resolve all artifacts for configuration ‘:app:debugRuntimeClasspath’. > Could not find com.sap.cloud.android:foundation:4.0.0. Searched in the following locations: - https://www.jitpack.io/com/sap/cloud/android/foundation/4.0.0/foundation-4.0.0.pom - https://repo.maven.apache.org/maven2/com/sap/cloud/android/foundation/4.0.0/foundation-4.0.0.pom - https://dl.google.com/dl/android/maven2/com/sap/cloud/android/foundation/4.0.0/foundation-4.0.0.pom - JFrog - file:/tmp/80544-android-2945/node_modules/react-native-v8/dist/com/sap/cloud/android/foundation/4.0.0/foundation-4.0.0.pom - file:/tmp/80544-android-2945/node_modules/v8-android/dist/com/sap/cloud/android/foundation/4.0.0/foundation-4.0.0.pom - file:/tmp/80544-android-2945/node_modules/detox/Detox-android/com/sap/cloud/android/foundation/4.0.0/foundation-4.0.0.pom Required by: project :app > project :appgyver-react-native-sap-btp-mobile > Could not find com.sap.cloud.android:fiori:4.0.0. Searched in the following locations: - https://www.jitpack.io/com/sap/cloud/android/fiori/4.0.0/fiori-4.0.0.pom - https://repo.maven.apache.org/maven2/com/sap/cloud/android/fiori/4.0.0/fiori-4.0.0.pom - https://dl.google.com/dl/android/maven2/com/sap/cloud/android/fiori/4.0.0/fiori-4.0.0.pom - JFrog - file:/tmp/80544-android-2945/node_modules/react-native-v8/dist/com/sap/cloud/android/fiori/4.0.0/fiori-4.0.0.pom - file:/tmp/80544-android-2945/node_modules/v8-android/dist/com/sap/cloud/android/fiori/4.0.0/fiori-4.0.0.pom - file:/tmp/80544-android-2945/node_modules/detox/Detox-android/com/sap/cloud/android/fiori/4.0.0/fiori-4.0.0.pom Required by: project :app > project :appgyver-react-native-sap-btp-mobile > Could not find com.sap.cloud.android:onboarding:4.0.0. Searched in the following locations: - https://www.jitpack.io/com/sap/cloud/android/onboarding/4.0.0/onboarding-4.0.0.pom - 4.0.0.pom - file:/tmp/80544-android-2945/node_modules/react-native-v8/dist/com/sap/cloud/android/onboarding/4.0.0/onboarding-4.0.0.pom - file:/tmp/80544-android-2945/node_modules/v8-android/dist/com/sap/cloud/android/onboarding/4.0.0/onboarding-4.0.0.pom - file:/tmp/80544-android-2945/node_modules/detox/Detox-android/com/sap/cloud/android/onboarding/4.0.0/onboarding-4.0.0.pom Required by: project :app > project :appgyver-react-native-sap-btp-mobile > Could not find com.sap.cloud.android:flowsv2:4.0.0. Searched in the following locations: - https://www.jitpack.io/com/sap/cloud/android/flowsv2/4.0.0/flowsv2-4.0.0.pom - https://repo.maven.apache.org/maven2/com/sap/cloud/android/flowsv2/4.0.0/flowsv2-4.0.0.pom - https://dl.google.com/dl/android/maven2/com/sap/cloud/android/flowsv2/4.0.0/flowsv2-4.0.0.pom - JFrog - file:/tmp/80544-android-2945/node_modules/react-native-v8/dist/com/sap/cloud/android/flowsv2/4.0.0/flowsv2-4.0.0.pom - file:/tmp/80544-android-2945/node_modules/v8-android/dist/com/sap/cloud/android/flowsv2/4.0.0/flowsv2-4.0.0.pom - file:/tmp/80544-android-2945/node_modules/detox/Detox-android/com/sap/cloud/android/flowsv2/4.0.0/flowsv2-4.0.0.pom Required by: project :app > project :appgyver-react-native-sap-btp-mobile * Try: Run with --stacktrace option to get the stack trace. Run with --info or --debug option to get more log output. Run with --scan to get full insights. * Get more help at https://help.gradle.org BUILD FAILED in 17s Error: Command failed with exit code 1: ./gradlew assembleRelease -x bundleReleaseJsAndAssets Warning: Mapping http://schemas.android.com/sdk/android/repo/repository2/01 Warning: Mapping new ns http://schemas.android.com/sdk/android/repo/repository2/03 to old ns http://schemas.android.com/sdk/android/repo/repository2/01 Warning: Mapping new ns http://schemas.android.com/sdk/android/repo/sys-img2/03 to old ns http://schemas.android.com/sdk/android/repo/sys-img2/01 Warning: Mapping new ns http://schemas.android.com/sdk/android/repo/sys-img2/02 to old ns http://schemas.android.com/sdk/android/repo/sys-img2/01 FAILURE: Build failed with an exception. * What went wrong: Could not determine the dependencies of task ‘:app:lintVitalRelease’. > Could not resolve all artifacts for configuration ‘:app:debugRuntimeClasspath’. > Could not find com.sap.cloud.android:foundation:4.0.0. Searched in the following locations: - https://www.jitpack.io/com/sap/cloud/android/foundation/4.0.0/foundation-4.0.0.pom - https://repo.maven.apache.org/maven2/com/sap/cloud/android/foundation/4.0.0/foundation-4.0.0.pom - https://dl.google.com/dl/android/maven2/com/sap/cloud/android/foundation/4.0.0/foundation-4.0.0.pom - JFrog - file:/tmp/80544-android-2945/node_modules/react-native-v8/dist/com/sap/cloud/android/foundation/4.0.0/foundation-4.0.0.pom - file:/tmp/80544-android-2945/node_modules/v8-android/dist/com/sap/cloud/android/foundation/4.0.0/foundation-4.0.0.pom - file:/tmp/80544-android-2945/node_modules/detox/Detox-android/com/sap/cloud/android/foundation/4.0.0/foundation-4.0.0.pom Required by: project :app > project :appgyver-react-native-sap-btp-mobile > Could not find com.sap.cloud.android:fiori:4.0.0. Searched in the following locations: - https://www.jitpack.io/com/sap/cloud/android/fiori/4.0.0/fiori-4.0.0.pom - https://repo.maven.apache.org/maven2/com/sap/cloud/android/fiori/4.0.0/fiori-4.0.0.pom - https://dl.google.com/dl/android/maven2/com/sap/cloud/android/fiori/4.0.0/fiori-4.0.0.pom - JFrog - file:/tmp/80544-android-2945/node_modules/react-native-v8/dist/com/sap/cloud/android/fiori/4.0.0/fiori-4.0.0.pom - file:/tmp/80544-android-2945/node_modules/v8-android/dist/com/sap/cloud/android/fiori/4.0.0/fiori-4.0.0.pom - file:/tmp/80544-android-2945/node_modules/detox/Detox-android/com/sap/cloud/android/fiori/4.0.0/fiori-4.0.0.pom Required by: project :app > project :appgyver-react-native-sap-btp-mobile > Could not find com.sap.cloud.android:onboarding:4.0.0. Searched in the following locations: - https://www.jitpack.io/com/sap/cloud/android/onboarding/4.0.0/onboarding-4.0.0.pom - https://repo.maven.apache.org/maven2/com/sap/cloud/android/onboarding/4.0.0/onboarding-4.0.0.pom - https://dl.google.com/dl/android/maven2/com/sap/cloud/android/onboarding/4.0.0/onboarding-android/com/sap/cloud/android/onboarding/4.0.0/onboarding-4.0.0.pom Required by: project :app > project :appgyver-react-native-sap-btp-mobile > Could not find com.sap.cloud.android:flowsv2:4.0.0. Searched in the following locations: - https://www.jitpack.io/com/sap/cloud/android/flowsv2/4.0.0/flowsv2-4.0.0.pom - https://repo.maven.apache.org/maven2/com/sap/cloud/android/flowsv2/4.0.0/flowsv2-4.0.0.pom - https://dl.google.com/dl/android/maven2/com/sap/cloud/android/flowsv2/4.0.0/flowsv2-4.0.0.pom - JFrog - file:/tmp/80544-android-2945/node_modules/react-native-v8/dist/com/sap/cloud/android/flowsv2/4.0.0/flowsv2-4.0.0.pom - file:/tmp/80544-android-2945/node_modules/v8-android/dist/com/sap/cloud/android/flowsv2/4.0.0/flowsv2-4.0.0.pom - file:/tmp/80544-android-2945/node_modules/detox/Detox-android/com/sap/cloud/android/flowsv2/4.0.0/flowsv2-4.0.0.pom Required by: project :app > project :appgyver-react-native-sap-btp-mobile * Try: Run with --stacktrace option to get the stack trace. Run with --info or --debug option to get more log output. Run with --scan to get full insights. * Get more help at https://help.gradle.org BUILD FAILED in 17s Configuration on demand is an incubating feature. > Configure project :app Warning: The ‘kotlin-android-extensions’ Gradle plugin is deprecated. Please use this migration guide (Migrate from Kotlin synthetics to Jetpack view binding  |  Android Developers) to start working with View Binding (View Binding  |  Android Developers) and the ‘kotlin-parcelize’ plugin. Copying ZSSRichTextEditor html asset file from /tmp/80544-android-2945/node_modules/@appgyver/react-native-zss-rich-text-editor/src/editor.html to /tmp/80544-android-2945/platformBuilds/standalone_android/app/src/main/assets > Configure project :lottie-react-native WARNING:: The specified Android SDK Build Tools version (28.0.0) is ignored, as it is below the minimum supported version (30.0.2) for Android Gradle Plugin 4.2.2. Android SDK Build Tools 30.0.2 will be used. To suppress this warning, remove “buildToolsVersion ‘28.0.0’” from your build.gradle file, as each version of the Android Gradle Plugin now has a default version of the build tools. > Configure project :react-native-android-open-settings WARNING:: minSdkVersion (26) is greater than targetSdkVersion (22) for variant “debug”. Please change the values such that minSdkVersion is less than or equal to targetSdkVersion. WARNING:: minSdkVersion (26) is greater than targetSdkVersion (22) for variant “release”. Please change the values such that minSdkVersion is less than or equal to targetSdkVersion. > Configure project :react-native-dynamic-fonts WARNING:: Configuration ‘compile’ is obsolete and has been replaced with ‘implementation’ and ‘api’. It will be removed in version 7.0 of the Android Gradle plugin. For more information, see Cómo agregar dependencias de compilación  |  Desarrolladores de Android  |  Android Developers. > Configure project :react-native-exception-handler WARNING:: minSdkVersion (26) is greater than targetSdkVersion (22) for variant “debug”. Please change the values such that minSdkVersion is less than or equal to targetSdkVersion. WARNING:: minSdkVersion (26) is greater than targetSdkVersion (22) for variant “release”. Please change the values such that minSdkVersion is less than or equal to targetSdkVersion. > Configure project :react-native-image-resizer WARNING:: Configuration ‘compile’ is obsolete and has been replaced with ‘implementation’ and ‘api’. It will be removed in version 7.0 of the Android Gradle plugin. For more information, see Cómo agregar dependencias de compilación  |  Desarrolladores de Android  |  Android Developers. WARNING:: minSdkVersion (26) is greater than targetSdkVersion (23) for variant “debug”. Please change the values such that minSdkVersion is less than or equal to targetSdkVersion. WARNING:: minSdkVersion (26) is greater than targetSdkVersion (23) for variant “release”. Please change the values such that minSdkVersion is less than or equal to targetSdkVersion. > Configure project :react-native-linear-gradient WARNING:: Configuration ‘provided’ is obsolete and has been replaced with ‘compileOnly’. It will be removed in version 7.0 of the Android Gradle plugin. For more information, see Cómo agregar dependencias de compilación  |  Desarrolladores de Android  |  Android Developers. > Configure project :react-native-picker WARNING:: Configuration ‘compile’ is obsolete and has been replaced with ‘implementation’ and ‘api’. It will be removed in version 7.0 of the Android Gradle plugin. For more information, see Cómo agregar dependencias de compilación  |  Desarrolladores de Android  |  Android Developers. > Configure project :react-native-screens WARNING:: minSdkVersion (26) is greater than targetSdkVersion (22) for variant “debug”. Please change the values such that minSdkVersion is less than or equal to targetSdkVersion. WARNING:: minSdkVersion (26) is greater than targetSdkVersion (22) for variant “release”. Please change the values such that minSdkVersion is less than or equal to targetSdkVersion. > Configure project :react-native-simple-compass WARNING:: Configuration ‘compile’ is obsolete and has been replaced with ‘implementation’ and ‘api’. It will be removed in version 7.0 of the Android Gradle plugin. For more information, see Cómo agregar dependencias de compilación  |  Desarrolladores de Android  |  Android Developers. WARNING:: minSdkVersion (26) is greater than targetSdkVersion (22) for variant “debug”. Please change the values such that minSdkVersion is less than or equal to targetSdkVersion. WARNING:: minSdkVersion (26) is greater than targetSdkVersion (22) for variant “release”. Please change the values such that minSdkVersion is less than or equal to targetSdkVersion. > Configure project :react-native-simple-shadow-view WARNING:: minSdkVersion (26) is greater than targetSdkVersion (16) for variant “debug”. Please change the values such that minSdkVersion is less than or equal to targetSdkVersion. WARNING:: minSdkVersion (26) is greater than targetSdkVersion (16) for variant “release”. Please change the values such that minSdkVersion is less than or equal to targetSdkVersion. > Configure project :react-native-webrtc WARNING:: minSdkVersion (26) is greater than targetSdkVersion (23) for variant “debug”. Please change the values such that minSdkVersion is less than or equal to targetSdkVersion. WARNING:: minSdkVersion (26) is greater than targetSdkVersion (23) for variant “release”. Please change the values such that minSdkVersion is less than or equal to targetSdkVersion. > Configure project :react-native-webview-bridge WARNING:: Configuration ‘compile’ is obsolete and has been replaced with ‘implementation’ and ‘api’. It will be removed in version 7.0 of the Android Gradle plugin. For more information, see Cómo agregar dependencias de compilación  |  Desarrolladores de Android  |  Android Developers. WARNING:: minSdkVersion (26) is greater than targetSdkVersion (23) for variant “debug”. Please change the values such that minSdkVersion is less than or equal to targetSdkVersion. WARNING:: minSdkVersion (26) is greater than targetSdkVersion (23) for variant “release”. Please change the values such that minSdkVersion is less than or equal to targetSdkVersion. Deprecated Gradle features were used in this build, making it incompatible with Gradle 7.0. Use ‘–warning-mode all’ to show the individual deprecation warnings. See Command-Line Interface at makeError (/tmp/80544-android-2945/node_modules/execa/lib/error.js:60:11) at handlePromise (/tmp/80544-android-2945/node_modules/execa/index.js:118:26) at processTicksAndRejections (node:internal/process/task_queues:96:5) │ │ │ Project location: │ │ ./platformBuilds/standalone_android │